{"text_format":"1","workbook":"xlsx","n_sheets":29,"sheets":["SUM","KONTROLY","TEST","Úvod","J1-1A","J1-1B","J1-1K","J1-2A","J1-2B","J1-2K","J1-3","J1-3K","J2","J3","J4","L","O1-1A","O1-1B","O1-1K","O1-2A","O1-2B","O1-2K","O1-3","O1-3K","O2","O3","O4","S1","S2"],"not_rendered":{"charts":0,"images":1,"macros":1,"external_links":0,"defined_names":120,"comments":2,"pivot_tables":0},"unopened":[],"bounds":{"document_bytes":16777216,"sheet_cells":100000,"rows_first":2000,"rows_last":500,"rows_between":2000,"halvings":0,"cell_chars":16384,"cell_head_chars":4096},"cells_cut":0,"cells_raw":0,"read":"whole","date_system":"1900"}

{"sheet":"SUM","index":0,"n_rows":5508,"n_cols":3,"rows_kept":5508,"cut":false,"hidden":false,"merged":[]}
[{"$f":"SUM(A3:A5508)","v":0},{"$f":"SUM(B3:B5508)","v":11422840},{"$f":"SUM(C3:C5508)+KONTROLY!C121","v":0}]
["Hodnota buňky","CENÍK","Odměna"]
[{"$f":"'J1-1A'!E10","v":0},15704,{"$f":"A3*B3","v":0}]
[{"$f":"'J1-1A'!E11","v":0},15704,{"$f":"A4*B4","v":0}]
[{"$f":"'J1-1A'!E12","v":0},15704,0]
[{"$f":"'J1-1A'!E13","v":0},15704,0]
[{"$f":"'J1-1A'!E14","v":0},15704,0]
[{"$f":"'J1-1A'!E15","v":0},15704,0]
[{"$f":"'J1-1A'!E16","v":0},15704,0]
[{"$f":"'J1-1A'!E17","v":0},15704,0]
[{"$f":"'J1-1A'!E18","v":0},15704,0]
[{"$f":"'J1-1A'!E19","v":0},17948,0]
[{"$f":"'J1-1A'!E20","v":0},17948,0]
[{"$f":"'J1-1A'!E21","v":0},17948,0]
[{"$f":"'J1-1A'!E22","v":0},17948,0]
[{"$f":"'J1-1A'!E23","v":0},15704,0]
[{"$f":"'J1-1A'!E24","v":0},15704,0]
[{"$f":"'J1-1A'!E25","v":0},15704,0]
[{"$f":"'J1-1A'!E26","v":0},15704,0]
[{"$f":"'J1-1A'!E27","v":0},15704,0]
[{"$f":"'J1-1A'!E28","v":0},15704,0]
[{"$f":"'J1-1A'!E29","v":0},25212,0]
[{"$f":"'J1-1A'!E30","v":0},25212,0]
[{"$f":"'J1-1A'!E31","v":0},10777,0]
[{"$f":"'J1-1A'!E32","v":0},2139,0]
[{"$f":"'J1-1A'!E33","v":0},10777,0]
[{"$f":"'J1-1A'!E34","v":0},2139,0]
[{"$f":"'J1-1A'!E36","v":0},25212,0]
[{"$f":"'J1-1A'!E41","v":0},1968,0]
[{"$f":"'J1-1A'!E42","v":0},1968,0]
[{"$f":"'J1-1A'!E43","v":0},1968,0]
[{"$f":"'J1-1A'!E44","v":0},5947,0]
[{"$f":"'J1-1A'!E45","v":0},5947,0]
[{"$f":"'J1-1A'!E46","v":0},5947,0]
[{"$f":"'J1-1A'!E47","v":0},5947,0]
[{"$f":"'J1-1A'!E48","v":0},5947,0]
[{"$f":"'J1-1A'!E49","v":0},4585,0]
[{"$f":"'J1-1A'!E50","v":0},4585,0]
[{"$f":"'J1-1A'!E51","v":0},1861,0]
[{"$f":"'J1-1A'!E52","v":0},25212,0]
[{"$f":"'J1-1A'!F10","v":0},15704,0]
[{"$f":"'J1-1A'!F11","v":0},15704,0]
[{"$f":"'J1-1A'!F12","v":0},15704,0]
[{"$f":"'J1-1A'!F13","v":0},15704,0]
[{"$f":"'J1-1A'!F14","v":0},15704,0]
[{"$f":"'J1-1A'!F15","v":0},15704,0]
[{"$f":"'J1-1A'!F16","v":0},15704,0]
[{"$f":"'J1-1A'!F17","v":0},15704,0]
[{"$f":"'J1-1A'!F18","v":0},15704,0]
[{"$f":"'J1-1A'!F19","v":0},17948,0]
[{"$f":"'J1-1A'!F20","v":0},17948,0]
[{"$f":"'J1-1A'!F21","v":0},17948,0]
[{"$f":"'J1-1A'!F22","v":0},17948,0]
[{"$f":"'J1-1A'!F23","v":0},15704,0]
[{"$f":"'J1-1A'!F24","v":0},15704,0]
[{"$f":"'J1-1A'!F25","v":0},15704,0]
[{"$f":"'J1-1A'!F26","v":0},15704,0]
[{"$f":"'J1-1A'!F27","v":0},15704,0]
[{"$f":"'J1-1A'!F28","v":0},15704,0]
[{"$f":"'J1-1A'!F29","v":0},25212,0]
[{"$f":"'J1-1A'!F30","v":0},25212,0]
[{"$f":"'J1-1A'!F31","v":0},10777,0]
[{"$f":"'J1-1A'!F32","v":0},2139,0]
[{"$f":"'J1-1A'!F33","v":0},10777,0]
[{"$f":"'J1-1A'!F34","v":0},2139,0]
[{"$f":"'J1-1A'!F36","v":0},25212,0]
[{"$f":"'J1-1A'!G10","v":0},15704,0]
[{"$f":"'J1-1A'!G11","v":0},15704,{"$f":"A68*B68","v":0}]
[{"$f":"'J1-1A'!G12","v":0},15704,0]
[{"$f":"'J1-1A'!G13","v":0},15704,0]
[{"$f":"'J1-1A'!G14","v":0},15704,0]
[{"$f":"'J1-1A'!G15","v":0},15704,0]
[{"$f":"'J1-1A'!G16","v":0},15704,0]
[{"$f":"'J1-1A'!G17","v":0},15704,0]
[{"$f":"'J1-1A'!G18","v":0},15704,0]
[{"$f":"'J1-1A'!G19","v":0},17948,0]
[{"$f":"'J1-1A'!G20","v":0},17948,0]
[{"$f":"'J1-1A'!G21","v":0},17948,0]
[{"$f":"'J1-1A'!G22","v":0},17948,0]
[{"$f":"'J1-1A'!G23","v":0},15704,0]
[{"$f":"'J1-1A'!G24","v":0},15704,0]
[{"$f":"'J1-1A'!G25","v":0},15704,0]
[{"$f":"'J1-1A'!G26","v":0},15704,0]
[{"$f":"'J1-1A'!G27","v":0},15704,0]
[{"$f":"'J1-1A'!G28","v":0},15704,0]
[{"$f":"'J1-1A'!G29","v":0},25212,0]
[{"$f":"'J1-1A'!G30","v":0},25212,0]
[{"$f":"'J1-1A'!G31","v":0},10777,0]
[{"$f":"'J1-1A'!G32","v":0},2139,0]
[{"$f":"'J1-1A'!G33","v":0},10777,0]
[{"$f":"'J1-1A'!G34","v":0},2139,0]
[{"$f":"'J1-1A'!G36","v":0},25212,0]
[{"$f":"'J1-1A'!G41","v":0},1968,0]
[{"$f":"'J1-1A'!G42","v":0},1968,0]
[{"$f":"'J1-1A'!G43","v":0},1968,0]
[{"$f":"'J1-1A'!G44","v":0},5947,0]
[{"$f":"'J1-1A'!G45","v":0},5947,0]
[{"$f":"'J1-1A'!G46","v":0},5947,0]
[{"$f":"'J1-1A'!G47","v":0},5947,0]
[{"$f":"'J1-1A'!G48","v":0},5947,0]
[{"$f":"'J1-1A'!G49","v":0},4585,0]
[{"$f":"'J1-1A'!G50","v":0},4585,0]
[{"$f":"'J1-1A'!G51","v":0},1861,0]
[{"$f":"'J1-1A'!G52","v":0},25212,0]
[{"$f":"'J1-1A'!H10","v":0},15704,0]
[{"$f":"'J1-1A'!H11","v":0},15704,0]
[{"$f":"'J1-1A'!H12","v":0},15704,0]
[{"$f":"'J1-1A'!H13","v":0},15704,0]
[{"$f":"'J1-1A'!H14","v":0},15704,0]
[{"$f":"'J1-1A'!H15","v":0},15704,0]
[{"$f":"'J1-1A'!H16","v":0},15704,0]
[{"$f":"'J1-1A'!H17","v":0},15704,0]
[{"$f":"'J1-1A'!H18","v":0},15704,0]
[{"$f":"'J1-1A'!H19","v":0},17948,0]
[{"$f":"'J1-1A'!H20","v":0},17948,0]
[{"$f":"'J1-1A'!H21","v":0},17948,0]
[{"$f":"'J1-1A'!H22","v":0},17948,0]
[{"$f":"'J1-1A'!H23","v":0},15704,0]
[{"$f":"'J1-1A'!H24","v":0},15704,0]
[{"$f":"'J1-1A'!H25","v":0},15704,0]
[{"$f":"'J1-1A'!H26","v":0},15704,0]
[{"$f":"'J1-1A'!H27","v":0},15704,0]
[{"$f":"'J1-1A'!H28","v":0},15704,0]
[{"$f":"'J1-1A'!H29","v":0},25212,0]
[{"$f":"'J1-1A'!H30","v":0},25212,0]
[{"$f":"'J1-1A'!H31","v":0},10777,0]
[{"$f":"'J1-1A'!H32","v":0},2139,0]
[{"$f":"'J1-1A'!H33","v":0},10777,0]
[{"$f":"'J1-1A'!H34","v":0},2139,0]
[{"$f":"'J1-1A'!H36","v":0},25212,0]
[{"$f":"'J1-1A'!I10","v":0},16843,0]
[{"$f":"'J1-1A'!I11","v":0},16843,{"$f":"A132*B132","v":0}]
[{"$f":"'J1-1A'!I12","v":0},16843,0]
[{"$f":"'J1-1A'!I13","v":0},16843,0]
[{"$f":"'J1-1A'!I14","v":0},16843,0]
[{"$f":"'J1-1A'!I15","v":0},16843,0]
[{"$f":"'J1-1A'!I16","v":0},16843,0]
[{"$f":"'J1-1A'!I17","v":0},16843,0]
[{"$f":"'J1-1A'!I18","v":0},16843,0]
[{"$f":"'J1-1A'!I19","v":0},17948,0]
[{"$f":"'J1-1A'!I20","v":0},17948,0]
[{"$f":"'J1-1A'!I21","v":0},17948,0]
[{"$f":"'J1-1A'!I22","v":0},17948,0]
[{"$f":"'J1-1A'!I23","v":0},16843,0]
[{"$f":"'J1-1A'!I24","v":0},16843,0]
[{"$f":"'J1-1A'!I25","v":0},16843,0]
[{"$f":"'J1-1A'!I26","v":0},16843,0]
[{"$f":"'J1-1A'!I27","v":0},16843,0]
[{"$f":"'J1-1A'!I28","v":0},16843,0]
[{"$f":"'J1-1A'!I29","v":0},25212,0]
[{"$f":"'J1-1A'!I30","v":0},25212,0]
[{"$f":"'J1-1A'!I31","v":0},4017,0]
[{"$f":"'J1-1A'!I32","v":0},2139,0]
[{"$f":"'J1-1A'!I33","v":0},4017,0]
[{"$f":"'J1-1A'!I34","v":0},2139,0]
[{"$f":"'J1-1A'!I35","v":0},7879,0]
[{"$f":"'J1-1A'!I36","v":0},25212,0]
[{"$f":"'J1-1A'!I41","v":0},1968,0]
[{"$f":"'J1-1A'!I42","v":0},1968,0]
[{"$f":"'J1-1A'!I43","v":0},1968,0]
[{"$f":"'J1-1A'!I44","v":0},5947,0]
[{"$f":"'J1-1A'!I45","v":0},5947,0]
[{"$f":"'J1-1A'!I46","v":0},5947,0]
[{"$f":"'J1-1A'!I47","v":0},5947,0]
[{"$f":"'J1-1A'!I48","v":0},5947,0]
[{"$f":"'J1-1A'!I49","v":0},4585,0]
[{"$f":"'J1-1A'!I50","v":0},4585,0]
[{"$f":"'J1-1A'!I51","v":0},1861,0]
[{"$f":"'J1-1A'!I52","v":0},25212,0]
[{"$f":"'J1-1A'!J10","v":0},16843,0]
[{"$f":"'J1-1A'!J11","v":0},16843,0]
[{"$f":"'J1-1A'!J12","v":0},16843,0]
[{"$f":"'J1-1A'!J13","v":0},16843,0]
[{"$f":"'J1-1A'!J14","v":0},16843,0]
[{"$f":"'J1-1A'!J15","v":0},16843,0]
[{"$f":"'J1-1A'!J16","v":0},16843,0]
[{"$f":"'J1-1A'!J17","v":0},16843,0]
[{"$f":"'J1-1A'!J18","v":0},16843,0]
[{"$f":"'J1-1A'!J19","v":0},17948,0]
[{"$f":"'J1-1A'!J20","v":0},17948,0]
[{"$f":"'J1-1A'!J21","v":0},17948,0]
[{"$f":"'J1-1A'!J22","v":0},17948,0]
[{"$f":"'J1-1A'!J23","v":0},16843,0]
[{"$f":"'J1-1A'!J24","v":0},16843,0]
[{"$f":"'J1-1A'!J25","v":0},16843,0]
[{"$f":"'J1-1A'!J26","v":0},16843,0]
[{"$f":"'J1-1A'!J27","v":0},16843,0]
[{"$f":"'J1-1A'!J28","v":0},16843,0]
[{"$f":"'J1-1A'!J29","v":0},25212,0]
[{"$f":"'J1-1A'!J30","v":0},25212,0]
[{"$f":"'J1-1A'!J31","v":0},4017,0]
[{"$f":"'J1-1A'!J32","v":0},2139,0]
[{"$f":"'J1-1A'!J33","v":0},4017,0]
[{"$f":"'J1-1A'!J34","v":0},2139,0]
[{"$f":"'J1-1A'!J35","v":0},7879,0]
[{"$f":"'J1-1A'!J36","v":0},25212,{"$f":"A196*B196","v":0}]
[{"$f":"'J1-1A'!K10","v":0},16843,0]
[{"$f":"'J1-1A'!K11","v":0},16843,0]
[{"$f":"'J1-1A'!K12","v":0},16843,0]
[{"$f":"'J1-1A'!K13","v":0},16843,0]
[{"$f":"'J1-1A'!K14","v":0},16843,0]
[{"$f":"'J1-1A'!K15","v":0},16843,0]
[{"$f":"'J1-1A'!K16","v":0},16843,0]
[{"$f":"'J1-1A'!K17","v":0},16843,0]
[{"$f":"'J1-1A'!K18","v":0},16843,0]
[{"$f":"'J1-1A'!K19","v":0},17948,0]
[{"$f":"'J1-1A'!K20","v":0},17948,0]
[{"$f":"'J1-1A'!K21","v":0},17948,0]
[{"$f":"'J1-1A'!K22","v":0},17948,0]
[{"$f":"'J1-1A'!K23","v":0},16843,0]
[{"$f":"'J1-1A'!K24","v":0},16843,0]
[{"$f":"'J1-1A'!K25","v":0},16843,0]
[{"$f":"'J1-1A'!K26","v":0},16843,0]
[{"$f":"'J1-1A'!K27","v":0},16843,0]
[{"$f":"'J1-1A'!K28","v":0},16843,0]
[{"$f":"'J1-1A'!K29","v":0},25212,0]
[{"$f":"'J1-1A'!K30","v":0},25212,0]
[{"$f":"'J1-1A'!K31","v":0},4017,0]
[{"$f":"'J1-1A'!K32","v":0},2139,0]
[{"$f":"'J1-1A'!K33","v":0},4017,0]
[{"$f":"'J1-1A'!K34","v":0},2139,0]
[{"$f":"'J1-1A'!K35","v":0},7879,0]
[{"$f":"'J1-1A'!K36","v":0},25212,0]
[{"$f":"'J1-1A'!K41","v":0},1968,0]
[{"$f":"'J1-1A'!K42","v":0},1968,0]
[{"$f":"'J1-1A'!K43","v":0},1968,0]
[{"$f":"'J1-1A'!K44","v":0},5947,0]
[{"$f":"'J1-1A'!K45","v":0},5947,0]
[{"$f":"'J1-1A'!K46","v":0},5947,0]
[{"$f":"'J1-1A'!K47","v":0},5947,0]
[{"$f":"'J1-1A'!K48","v":0},5947,0]
[{"$f":"'J1-1A'!K49","v":0},4585,0]
[{"$f":"'J1-1A'!K50","v":0},4585,0]
[{"$f":"'J1-1A'!K51","v":0},1861,0]
[{"$f":"'J1-1A'!K52","v":0},25212,0]
[{"$f":"'J1-1A'!L10","v":0},16843,0]
[{"$f":"'J1-1A'!L11","v":0},16843,0]
[{"$f":"'J1-1A'!L12","v":0},16843,0]
[{"$f":"'J1-1A'!L13","v":0},16843,0]
[{"$f":"'J1-1A'!L14","v":0},16843,0]
[{"$f":"'J1-1A'!L15","v":0},16843,0]
[{"$f":"'J1-1A'!L16","v":0},16843,0]
[{"$f":"'J1-1A'!L17","v":0},16843,0]
[{"$f":"'J1-1A'!L18","v":0},16843,0]
[{"$f":"'J1-1A'!L19","v":0},17948,0]
[{"$f":"'J1-1A'!L20","v":0},17948,0]
[{"$f":"'J1-1A'!L21","v":0},17948,0]
[{"$f":"'J1-1A'!L22","v":0},17948,0]
[{"$f":"'J1-1A'!L23","v":0},16843,0]
[{"$f":"'J1-1A'!L24","v":0},16843,0]
[{"$f":"'J1-1A'!L25","v":0},16843,0]
[{"$f":"'J1-1A'!L26","v":0},16843,0]
[{"$f":"'J1-1A'!L27","v":0},16843,0]
[{"$f":"'J1-1A'!L28","v":0},16843,0]
[{"$f":"'J1-1A'!L29","v":0},25212,0]
[{"$f":"'J1-1A'!L30","v":0},25212,0]
[{"$f":"'J1-1A'!L31","v":0},4017,0]
[{"$f":"'J1-1A'!L32","v":0},2139,0]
[{"$f":"'J1-1A'!L33","v":0},4017,0]
[{"$f":"'J1-1A'!L34","v":0},2139,{"$f":"A260*B260","v":0}]
[{"$f":"'J1-1A'!L35","v":0},7879,0]
[{"$f":"'J1-1A'!L36","v":0},25212,0]
[{"$f":"'J1-1A'!M10","v":0},16843,0]
[{"$f":"'J1-1A'!M11","v":0},16843,0]
[{"$f":"'J1-1A'!M12","v":0},16843,0]
[{"$f":"'J1-1A'!M13","v":0},16843,0]
[{"$f":"'J1-1A'!M14","v":0},16843,0]
[{"$f":"'J1-1A'!M15","v":0},16843,0]
[{"$f":"'J1-1A'!M16","v":0},16843,0]
[{"$f":"'J1-1A'!M17","v":0},16843,0]
[{"$f":"'J1-1A'!M18","v":0},16843,0]
[{"$f":"'J1-1A'!M19","v":0},17948,0]
[{"$f":"'J1-1A'!M20","v":0},17948,0]
[{"$f":"'J1-1A'!M21","v":0},17948,0]
[{"$f":"'J1-1A'!M22","v":0},17948,0]
[{"$f":"'J1-1A'!M23","v":0},16843,0]
[{"$f":"'J1-1A'!M24","v":0},16843,0]
[{"$f":"'J1-1A'!M25","v":0},16843,0]
[{"$f":"'J1-1A'!M26","v":0},16843,0]
[{"$f":"'J1-1A'!M27","v":0},16843,0]
[{"$f":"'J1-1A'!M28","v":0},16843,0]
[{"$f":"'J1-1A'!M29","v":0},25212,0]
[{"$f":"'J1-1A'!M30","v":0},25212,0]
[{"$f":"'J1-1A'!M31","v":0},4017,0]
[{"$f":"'J1-1A'!M32","v":0},2139,0]
[{"$f":"'J1-1A'!M33","v":0},4017,0]
[{"$f":"'J1-1A'!M34","v":0},2139,0]
[{"$f":"'J1-1A'!M35","v":0},7879,0]
[{"$f":"'J1-1A'!M36","v":0},25212,0]
[{"$f":"'J1-1A'!N10","v":0},16843,0]
[{"$f":"'J1-1A'!N11","v":0},16843,0]
[{"$f":"'J1-1A'!N12","v":0},16843,0]
[{"$f":"'J1-1A'!N13","v":0},16843,0]
[{"$f":"'J1-1A'!N14","v":0},16843,0]
[{"$f":"'J1-1A'!N15","v":0},16843,0]
[{"$f":"'J1-1A'!N16","v":0},16843,0]
[{"$f":"'J1-1A'!N17","v":0},16843,0]
[{"$f":"'J1-1A'!N18","v":0},16843,0]
[{"$f":"'J1-1A'!N19","v":0},17948,0]
[{"$f":"'J1-1A'!N20","v":0},17948,0]
[{"$f":"'J1-1A'!N21","v":0},17948,0]
[{"$f":"'J1-1A'!N22","v":0},17948,0]
[{"$f":"'J1-1A'!N23","v":0},16843,0]
[{"$f":"'J1-1A'!N24","v":0},16843,0]
[{"$f":"'J1-1A'!N25","v":0},16843,0]
[{"$f":"'J1-1A'!N26","v":0},16843,0]
[{"$f":"'J1-1A'!N27","v":0},16843,0]
[{"$f":"'J1-1A'!N28","v":0},16843,0]
[{"$f":"'J1-1A'!N29","v":0},25212,0]
[{"$f":"'J1-1A'!N30","v":0},25212,0]
[{"$f":"'J1-1A'!N31","v":0},4017,0]
[{"$f":"'J1-1A'!N32","v":0},2139,0]
[{"$f":"'J1-1A'!N33","v":0},4017,0]
[{"$f":"'J1-1A'!N34","v":0},2139,0]
[{"$f":"'J1-1A'!N35","v":0},7879,0]
[{"$f":"'J1-1A'!N36","v":0},25212,0]
[{"$f":"'J1-1A'!O10","v":0},16843,0]
[{"$f":"'J1-1A'!O11","v":0},16843,0]
[{"$f":"'J1-1A'!O12","v":0},16843,0]
[{"$f":"'J1-1A'!O13","v":0},16843,0]
[{"$f":"'J1-1A'!O14","v":0},16843,0]
[{"$f":"'J1-1A'!O15","v":0},16843,0]
[{"$f":"'J1-1A'!O16","v":0},16843,0]
[{"$f":"'J1-1A'!O17","v":0},16843,{"$f":"A324*B324","v":0}]
[{"$f":"'J1-1A'!O18","v":0},16843,0]
[{"$f":"'J1-1A'!O19","v":0},17948,0]
[{"$f":"'J1-1A'!O20","v":0},17948,0]
[{"$f":"'J1-1A'!O21","v":0},17948,0]
[{"$f":"'J1-1A'!O22","v":0},17948,0]
[{"$f":"'J1-1A'!O23","v":0},16843,0]
[{"$f":"'J1-1A'!O24","v":0},16843,0]
[{"$f":"'J1-1A'!O25","v":0},16843,0]
[{"$f":"'J1-1A'!O26","v":0},16843,0]
[{"$f":"'J1-1A'!O27","v":0},16843,0]
[{"$f":"'J1-1A'!O28","v":0},16843,0]
[{"$f":"'J1-1A'!O29","v":0},25212,0]
[{"$f":"'J1-1A'!O30","v":0},25212,0]
[{"$f":"'J1-1A'!O31","v":0},4017,0]
[{"$f":"'J1-1A'!O32","v":0},2139,0]
[{"$f":"'J1-1A'!O33","v":0},4017,0]
[{"$f":"'J1-1A'!O34","v":0},2139,0]
[{"$f":"'J1-1A'!O35","v":0},7879,0]
[{"$f":"'J1-1A'!O36","v":0},25212,0]
[{"$f":"'J1-1A'!P10","v":0},16843,0]
[{"$f":"'J1-1A'!P11","v":0},16843,0]
[{"$f":"'J1-1A'!P12","v":0},16843,0]
[{"$f":"'J1-1A'!P13","v":0},16843,0]
[{"$f":"'J1-1A'!P14","v":0},16843,0]
[{"$f":"'J1-1A'!P15","v":0},16843,0]
[{"$f":"'J1-1A'!P16","v":0},16843,0]
[{"$f":"'J1-1A'!P17","v":0},16843,0]
[{"$f":"'J1-1A'!P18","v":0},16843,0]
[{"$f":"'J1-1A'!P19","v":0},17948,0]
[{"$f":"'J1-1A'!P20","v":0},17948,0]
[{"$f":"'J1-1A'!P21","v":0},17948,0]
[{"$f":"'J1-1A'!P22","v":0},17948,0]
[{"$f":"'J1-1A'!P23","v":0},16843,0]
[{"$f":"'J1-1A'!P24","v":0},16843,0]
[{"$f":"'J1-1A'!P25","v":0},16843,0]
[{"$f":"'J1-1A'!P26","v":0},16843,0]
[{"$f":"'J1-1A'!P27","v":0},16843,0]
[{"$f":"'J1-1A'!P28","v":0},16843,0]
[{"$f":"'J1-1A'!P29","v":0},25212,0]
[{"$f":"'J1-1A'!P30","v":0},25212,0]
[{"$f":"'J1-1A'!P31","v":0},4017,0]
[{"$f":"'J1-1A'!P32","v":0},2139,0]
[{"$f":"'J1-1A'!P33","v":0},4017,0]
[{"$f":"'J1-1A'!P34","v":0},2139,0]
[{"$f":"'J1-1A'!P35","v":0},7879,0]
[{"$f":"'J1-1A'!P36","v":0},25212,0]
[{"$f":"'J1-1B'!E11","v":0},773,0]
[{"$f":"'J1-1B'!E12","v":0},773,0]
[{"$f":"'J1-1B'!E13","v":0},773,0]
[{"$f":"'J1-1B'!E14","v":0},773,0]
[{"$f":"'J1-1B'!E15","v":0},773,0]
[{"$f":"'J1-1B'!E16","v":0},773,0]
[{"$f":"'J1-1B'!E17","v":0},773,0]
[{"$f":"'J1-1B'!E18","v":0},773,0]
[{"$f":"'J1-1B'!E19","v":0},773,0]
[{"$f":"'J1-1B'!E20","v":0},773,0]
[{"$f":"'J1-1B'!E21","v":0},773,0]
[{"$f":"'J1-1B'!E22","v":0},773,0]
[{"$f":"'J1-1B'!E23","v":0},773,0]
[{"$f":"'J1-1B'!E24","v":0},773,0]
[{"$f":"'J1-1B'!E25","v":0},773,0]
[{"$f":"'J1-1B'!E26","v":0},773,0]
[{"$f":"'J1-1B'!E27","v":0},773,0]
[{"$f":"'J1-1B'!E28","v":0},773,{"$f":"A388*B388","v":0}]
[{"$f":"'J1-1B'!E29","v":0},773,0]
[{"$f":"'J1-1B'!E30","v":0},773,0]
[{"$f":"'J1-1B'!E31","v":0},319,0]
[{"$f":"'J1-1B'!E32","v":0},319,0]
[{"$f":"'J1-1B'!E33","v":0},319,0]
[{"$f":"'J1-1B'!E34","v":0},319,0]
[{"$f":"'J1-1B'!E35","v":0},2727,0]
[{"$f":"'J1-1B'!E42","v":0},377,0]
[{"$f":"'J1-1B'!E43","v":0},377,0]
[{"$f":"'J1-1B'!E44","v":0},377,0]
[{"$f":"'J1-1B'!E45","v":0},377,0]
[{"$f":"'J1-1B'!E46","v":0},377,0]
[{"$f":"'J1-1B'!E47","v":0},1719,0]
[{"$f":"'J1-1B'!E48","v":0},1719,0]
[{"$f":"'J1-1B'!E49","v":0},1861,0]
[{"$f":"'J1-1B'!E50","v":0},1861,0]
[{"$f":"'J1-1B'!F11","v":0},773,0]
[{"$f":"'J1-1B'!F12","v":0},773,0]
[{"$f":"'J1-1B'!F13","v":0},773,0]
[{"$f":"'J1-1B'!F14","v":0},773,0]
[{"$f":"'J1-1B'!F15","v":0},773,0]
[{"$f":"'J1-1B'!F16","v":0},773,0]
[{"$f":"'J1-1B'!F17","v":0},773,0]
[{"$f":"'J1-1B'!F18","v":0},773,0]
[{"$f":"'J1-1B'!F19","v":0},773,0]
[{"$f":"'J1-1B'!F20","v":0},773,0]
[{"$f":"'J1-1B'!F21","v":0},773,0]
[{"$f":"'J1-1B'!F22","v":0},773,0]
[{"$f":"'J1-1B'!F23","v":0},773,0]
[{"$f":"'J1-1B'!F24","v":0},773,0]
[{"$f":"'J1-1B'!F25","v":0},773,0]
[{"$f":"'J1-1B'!F26","v":0},773,0]
[{"$f":"'J1-1B'!F27","v":0},773,0]
[{"$f":"'J1-1B'!F28","v":0},773,0]
[{"$f":"'J1-1B'!F29","v":0},773,0]
[{"$f":"'J1-1B'!F30","v":0},773,0]
[{"$f":"'J1-1B'!F31","v":0},319,0]
[{"$f":"'J1-1B'!F32","v":0},319,0]
[{"$f":"'J1-1B'!F33","v":0},319,0]
[{"$f":"'J1-1B'!F34","v":0},319,0]
[{"$f":"'J1-1B'!F35","v":0},2727,0]
[{"$f":"'J1-1B'!G11","v":0},148,0]
[{"$f":"'J1-1B'!G12","v":0},148,0]
[{"$f":"'J1-1B'!G13","v":0},148,0]
[{"$f":"'J1-1B'!G14","v":0},148,0]
[{"$f":"'J1-1B'!G15","v":0},148,0]
[{"$f":"'J1-1B'!G16","v":0},148,0]
[{"$f":"'J1-1B'!G17","v":0},148,0]
[{"$f":"'J1-1B'!G18","v":0},148,0]
[{"$f":"'J1-1B'!G19","v":0},148,0]
[{"$f":"'J1-1B'!G20","v":0},148,0]
[{"$f":"'J1-1B'!G21","v":0},148,0]
[{"$f":"'J1-1B'!G22","v":0},148,0]
[{"$f":"'J1-1B'!G23","v":0},148,0]
[{"$f":"'J1-1B'!G24","v":0},148,0]
[{"$f":"'J1-1B'!G25","v":0},148,0]
[{"$f":"'J1-1B'!G26","v":0},148,0]
[{"$f":"'J1-1B'!G27","v":0},148,0]
[{"$f":"'J1-1B'!G28","v":0},148,0]
[{"$f":"'J1-1B'!G29","v":0},148,0]
[{"$f":"'J1-1B'!G30","v":0},148,0]
[{"$f":"'J1-1B'!G31","v":0},319,0]
[{"$f":"'J1-1B'!G32","v":0},319,0]
[{"$f":"'J1-1B'!G33","v":0},319,{"$f":"A452*B452","v":0}]
[{"$f":"'J1-1B'!G34","v":0},319,0]
[{"$f":"'J1-1B'!G35","v":0},2727,0]
[{"$f":"'J1-1B'!G42","v":0},377,0]
[{"$f":"'J1-1B'!G43","v":0},377,0]
[{"$f":"'J1-1B'!G44","v":0},377,0]
[{"$f":"'J1-1B'!G45","v":0},377,0]
[{"$f":"'J1-1B'!G46","v":0},377,0]
[{"$f":"'J1-1B'!G47","v":0},1719,0]
[{"$f":"'J1-1B'!G48","v":0},1719,0]
[{"$f":"'J1-1B'!G49","v":0},1861,0]
[{"$f":"'J1-1B'!G50","v":0},1861,0]
[{"$f":"'J1-1B'!H11","v":0},148,0]
[{"$f":"'J1-1B'!H12","v":0},148,0]
[{"$f":"'J1-1B'!H13","v":0},148,0]
[{"$f":"'J1-1B'!H14","v":0},148,0]
[{"$f":"'J1-1B'!H15","v":0},148,0]
[{"$f":"'J1-1B'!H16","v":0},148,0]
[{"$f":"'J1-1B'!H17","v":0},148,0]
[{"$f":"'J1-1B'!H18","v":0},148,0]
[{"$f":"'J1-1B'!H19","v":0},148,0]
[{"$f":"'J1-1B'!H20","v":0},148,0]
[{"$f":"'J1-1B'!H21","v":0},148,0]
[{"$f":"'J1-1B'!H22","v":0},148,0]
[{"$f":"'J1-1B'!H23","v":0},148,0]
[{"$f":"'J1-1B'!H24","v":0},148,0]
[{"$f":"'J1-1B'!H25","v":0},148,0]
[{"$f":"'J1-1B'!H26","v":0},148,0]
[{"$f":"'J1-1B'!H27","v":0},148,0]
[{"$f":"'J1-1B'!H28","v":0},148,0]
[{"$f":"'J1-1B'!H29","v":0},148,0]
[{"$f":"'J1-1B'!H30","v":0},148,0]
[{"$f":"'J1-1B'!H31","v":0},319,0]
[{"$f":"'J1-1B'!H32","v":0},319,0]
[{"$f":"'J1-1B'!H33","v":0},319,0]
[{"$f":"'J1-1B'!H34","v":0},319,0]
[{"$f":"'J1-1B'!H35","v":0},2727,0]
[{"$f":"'J1-1B'!I11","v":0},773,0]
[{"$f":"'J1-1B'!I12","v":0},773,0]
[{"$f":"'J1-1B'!I13","v":0},773,0]
[{"$f":"'J1-1B'!I14","v":0},773,0]
[{"$f":"'J1-1B'!I15","v":0},773,0]
[{"$f":"'J1-1B'!I16","v":0},773,0]
[{"$f":"'J1-1B'!I17","v":0},773,0]
[{"$f":"'J1-1B'!I18","v":0},773,0]
[{"$f":"'J1-1B'!I19","v":0},773,0]
[{"$f":"'J1-1B'!I20","v":0},773,0]
[{"$f":"'J1-1B'!I21","v":0},773,0]
[{"$f":"'J1-1B'!I22","v":0},773,0]
[{"$f":"'J1-1B'!I23","v":0},773,0]
[{"$f":"'J1-1B'!I24","v":0},773,0]
[{"$f":"'J1-1B'!I25","v":0},773,0]
[{"$f":"'J1-1B'!I26","v":0},773,0]
[{"$f":"'J1-1B'!I27","v":0},773,0]
[{"$f":"'J1-1B'!I28","v":0},773,0]
[{"$f":"'J1-1B'!I29","v":0},773,0]
[{"$f":"'J1-1B'!I30","v":0},773,0]
[{"$f":"'J1-1B'!I31","v":0},319,0]
[{"$f":"'J1-1B'!I32","v":0},319,0]
[{"$f":"'J1-1B'!I33","v":0},319,0]
[{"$f":"'J1-1B'!I34","v":0},319,0]
[{"$f":"'J1-1B'!I35","v":0},2727,0]
[{"$f":"'J1-1B'!I42","v":0},377,0]
[{"$f":"'J1-1B'!I43","v":0},377,0]
[{"$f":"'J1-1B'!I44","v":0},377,{"$f":"A516*B516","v":0}]
[{"$f":"'J1-1B'!I45","v":0},377,0]
[{"$f":"'J1-1B'!I46","v":0},377,0]
[{"$f":"'J1-1B'!I47","v":0},1719,0]
[{"$f":"'J1-1B'!I48","v":0},1719,0]
[{"$f":"'J1-1B'!I49","v":0},1861,0]
[{"$f":"'J1-1B'!I50","v":0},1861,0]
[{"$f":"'J1-1B'!J11","v":0},773,0]
[{"$f":"'J1-1B'!J12","v":0},773,0]
[{"$f":"'J1-1B'!J13","v":0},773,0]
[{"$f":"'J1-1B'!J14","v":0},773,0]
[{"$f":"'J1-1B'!J15","v":0},773,0]
[{"$f":"'J1-1B'!J16","v":0},773,0]
[{"$f":"'J1-1B'!J17","v":0},773,0]
[{"$f":"'J1-1B'!J18","v":0},773,0]
[{"$f":"'J1-1B'!J19","v":0},773,0]
[{"$f":"'J1-1B'!J20","v":0},773,0]
[{"$f":"'J1-1B'!J21","v":0},773,0]
[{"$f":"'J1-1B'!J22","v":0},773,0]
[{"$f":"'J1-1B'!J23","v":0},773,0]
[{"$f":"'J1-1B'!J24","v":0},773,0]
[{"$f":"'J1-1B'!J25","v":0},773,0]
[{"$f":"'J1-1B'!J26","v":0},773,0]
[{"$f":"'J1-1B'!J27","v":0},773,0]
[{"$f":"'J1-1B'!J28","v":0},773,0]
[{"$f":"'J1-1B'!J29","v":0},773,0]
[{"$f":"'J1-1B'!J30","v":0},773,0]
[{"$f":"'J1-1B'!J31","v":0},319,0]
[{"$f":"'J1-1B'!J32","v":0},319,0]
[{"$f":"'J1-1B'!J33","v":0},319,0]
[{"$f":"'J1-1B'!J34","v":0},319,0]
[{"$f":"'J1-1B'!J35","v":0},2727,0]
[{"$f":"'J1-1B'!K11","v":0},148,0]
[{"$f":"'J1-1B'!K12","v":0},148,0]
[{"$f":"'J1-1B'!K13","v":0},148,0]
[{"$f":"'J1-1B'!K14","v":0},148,0]
[{"$f":"'J1-1B'!K15","v":0},148,0]
[{"$f":"'J1-1B'!K16","v":0},148,0]
[{"$f":"'J1-1B'!K17","v":0},148,0]
[{"$f":"'J1-1B'!K18","v":0},148,0]
[{"$f":"'J1-1B'!K19","v":0},148,0]
[{"$f":"'J1-1B'!K20","v":0},148,0]
[{"$f":"'J1-1B'!K21","v":0},148,0]
[{"$f":"'J1-1B'!K22","v":0},148,0]
[{"$f":"'J1-1B'!K23","v":0},148,0]
[{"$f":"'J1-1B'!K24","v":0},148,0]
[{"$f":"'J1-1B'!K25","v":0},148,0]
[{"$f":"'J1-1B'!K26","v":0},148,0]
[{"$f":"'J1-1B'!K27","v":0},148,0]
[{"$f":"'J1-1B'!K28","v":0},148,0]
[{"$f":"'J1-1B'!K29","v":0},148,0]
[{"$f":"'J1-1B'!K30","v":0},148,0]
[{"$f":"'J1-1B'!K31","v":0},319,0]
[{"$f":"'J1-1B'!K32","v":0},319,0]
[{"$f":"'J1-1B'!K33","v":0},319,0]
[{"$f":"'J1-1B'!K34","v":0},319,0]
[{"$f":"'J1-1B'!K35","v":0},2727,0]
[{"$f":"'J1-1B'!K42","v":0},377,0]
[{"$f":"'J1-1B'!K43","v":0},377,0]
[{"$f":"'J1-1B'!K44","v":0},377,0]
[{"$f":"'J1-1B'!K45","v":0},377,0]
[{"$f":"'J1-1B'!K46","v":0},377,0]
[{"$f":"'J1-1B'!K47","v":0},1719,0]
[{"$f":"'J1-1B'!K48","v":0},1719,0]
[{"$f":"'J1-1B'!K49","v":0},1861,{"$f":"A580*B580","v":0}]
[{"$f":"'J1-1B'!K50","v":0},1861,0]
[{"$f":"'J1-1B'!L11","v":0},148,0]
[{"$f":"'J1-1B'!L12","v":0},148,0]
[{"$f":"'J1-1B'!L13","v":0},148,0]
[{"$f":"'J1-1B'!L14","v":0},148,0]
[{"$f":"'J1-1B'!L15","v":0},148,0]
[{"$f":"'J1-1B'!L16","v":0},148,0]
[{"$f":"'J1-1B'!L17","v":0},148,0]
[{"$f":"'J1-1B'!L18","v":0},148,0]
[{"$f":"'J1-1B'!L19","v":0},148,0]
[{"$f":"'J1-1B'!L20","v":0},148,0]
[{"$f":"'J1-1B'!L21","v":0},148,0]
[{"$f":"'J1-1B'!L22","v":0},148,0]
[{"$f":"'J1-1B'!L23","v":0},148,0]
[{"$f":"'J1-1B'!L24","v":0},148,0]
[{"$f":"'J1-1B'!L25","v":0},148,0]
[{"$f":"'J1-1B'!L26","v":0},148,0]
[{"$f":"'J1-1B'!L27","v":0},148,0]
[{"$f":"'J1-1B'!L28","v":0},148,0]
[{"$f":"'J1-1B'!L29","v":0},148,0]
[{"$f":"'J1-1B'!L30","v":0},148,0]
[{"$f":"'J1-1B'!L31","v":0},319,0]
[{"$f":"'J1-1B'!L32","v":0},319,0]
[{"$f":"'J1-1B'!L33","v":0},319,0]
[{"$f":"'J1-1B'!L34","v":0},319,0]
[{"$f":"'J1-1B'!L35","v":0},2727,0]
[{"$f":"'J1-1B'!M11","v":0},773,0]
[{"$f":"'J1-1B'!M12","v":0},773,0]
[{"$f":"'J1-1B'!M13","v":0},773,0]
[{"$f":"'J1-1B'!M14","v":0},773,0]
[{"$f":"'J1-1B'!M15","v":0},773,0]
[{"$f":"'J1-1B'!M16","v":0},773,0]
[{"$f":"'J1-1B'!M17","v":0},773,0]
[{"$f":"'J1-1B'!M18","v":0},773,0]
[{"$f":"'J1-1B'!M19","v":0},773,0]
[{"$f":"'J1-1B'!M20","v":0},773,0]
[{"$f":"'J1-1B'!M21","v":0},773,0]
[{"$f":"'J1-1B'!M22","v":0},773,0]
[{"$f":"'J1-1B'!M23","v":0},773,0]
[{"$f":"'J1-1B'!M24","v":0},773,0]
[{"$f":"'J1-1B'!M25","v":0},773,0]
[{"$f":"'J1-1B'!M26","v":0},773,0]
[{"$f":"'J1-1B'!M27","v":0},773,0]
[{"$f":"'J1-1B'!M28","v":0},773,0]
[{"$f":"'J1-1B'!M29","v":0},773,0]
[{"$f":"'J1-1B'!M30","v":0},773,0]
[{"$f":"'J1-1B'!M31","v":0},319,0]
[{"$f":"'J1-1B'!M32","v":0},319,0]
[{"$f":"'J1-1B'!M33","v":0},319,0]
[{"$f":"'J1-1B'!M34","v":0},319,0]
[{"$f":"'J1-1B'!M35","v":0},2727,0]
[{"$f":"'J1-1B'!M42","v":0},377,0]
[{"$f":"'J1-1B'!M43","v":0},377,0]
[{"$f":"'J1-1B'!M44","v":0},377,0]
[{"$f":"'J1-1B'!M45","v":0},377,0]
[{"$f":"'J1-1B'!M46","v":0},377,0]
[{"$f":"'J1-1B'!M47","v":0},1719,0]
[{"$f":"'J1-1B'!M48","v":0},1719,0]
[{"$f":"'J1-1B'!M49","v":0},1861,0]
[{"$f":"'J1-1B'!M50","v":0},1861,0]
[{"$f":"'J1-1B'!N11","v":0},773,0]
[{"$f":"'J1-1B'!N12","v":0},773,0]
[{"$f":"'J1-1B'!N13","v":0},773,0]
[{"$f":"'J1-1B'!N14","v":0},773,{"$f":"A644*B644","v":0}]
[{"$f":"'J1-1B'!N15","v":0},773,0]
[{"$f":"'J1-1B'!N16","v":0},773,0]
[{"$f":"'J1-1B'!N17","v":0},773,0]
[{"$f":"'J1-1B'!N18","v":0},773,0]
[{"$f":"'J1-1B'!N19","v":0},773,0]
[{"$f":"'J1-1B'!N20","v":0},773,0]
[{"$f":"'J1-1B'!N21","v":0},773,0]
[{"$f":"'J1-1B'!N22","v":0},773,0]
[{"$f":"'J1-1B'!N23","v":0},773,0]
[{"$f":"'J1-1B'!N24","v":0},773,0]
[{"$f":"'J1-1B'!N25","v":0},773,0]
[{"$f":"'J1-1B'!N26","v":0},773,0]
[{"$f":"'J1-1B'!N27","v":0},773,0]
[{"$f":"'J1-1B'!N28","v":0},773,0]
[{"$f":"'J1-1B'!N29","v":0},773,0]
[{"$f":"'J1-1B'!N30","v":0},773,0]
[{"$f":"'J1-1B'!N31","v":0},319,0]
[{"$f":"'J1-1B'!N32","v":0},319,0]
[{"$f":"'J1-1B'!N33","v":0},319,0]
[{"$f":"'J1-1B'!N34","v":0},319,0]
[{"$f":"'J1-1B'!N35","v":0},2727,0]
[{"$f":"'J1-1B'!O11","v":0},148,0]
[{"$f":"'J1-1B'!O12","v":0},148,0]
[{"$f":"'J1-1B'!O13","v":0},148,0]
[{"$f":"'J1-1B'!O14","v":0},148,0]
[{"$f":"'J1-1B'!O15","v":0},148,0]
[{"$f":"'J1-1B'!O16","v":0},148,0]
[{"$f":"'J1-1B'!O17","v":0},148,0]
[{"$f":"'J1-1B'!O18","v":0},148,0]
[{"$f":"'J1-1B'!O19","v":0},148,0]
[{"$f":"'J1-1B'!O20","v":0},148,0]
[{"$f":"'J1-1B'!O21","v":0},148,0]
[{"$f":"'J1-1B'!O22","v":0},148,0]
[{"$f":"'J1-1B'!O23","v":0},148,0]
[{"$f":"'J1-1B'!O24","v":0},148,0]
[{"$f":"'J1-1B'!O25","v":0},148,0]
[{"$f":"'J1-1B'!O26","v":0},148,0]
[{"$f":"'J1-1B'!O27","v":0},148,0]
[{"$f":"'J1-1B'!O28","v":0},148,0]
[{"$f":"'J1-1B'!O29","v":0},148,0]
[{"$f":"'J1-1B'!O30","v":0},148,0]
[{"$f":"'J1-1B'!O31","v":0},319,0]
[{"$f":"'J1-1B'!O32","v":0},319,0]
[{"$f":"'J1-1B'!O33","v":0},319,0]
[{"$f":"'J1-1B'!O34","v":0},319,0]
[{"$f":"'J1-1B'!O35","v":0},2727,0]
[{"$f":"'J1-1B'!O42","v":0},377,0]
[{"$f":"'J1-1B'!O43","v":0},377,0]
[{"$f":"'J1-1B'!O44","v":0},377,0]
[{"$f":"'J1-1B'!O45","v":0},377,0]
[{"$f":"'J1-1B'!O46","v":0},377,0]
[{"$f":"'J1-1B'!O47","v":0},1719,0]
[{"$f":"'J1-1B'!O48","v":0},1719,0]
[{"$f":"'J1-1B'!O49","v":0},1861,0]
[{"$f":"'J1-1B'!O50","v":0},1861,0]
[{"$f":"'J1-1B'!P11","v":0},148,0]
[{"$f":"'J1-1B'!P12","v":0},148,0]
[{"$f":"'J1-1B'!P13","v":0},148,0]
[{"$f":"'J1-1B'!P14","v":0},148,0]
[{"$f":"'J1-1B'!P15","v":0},148,0]
[{"$f":"'J1-1B'!P16","v":0},148,0]
[{"$f":"'J1-1B'!P17","v":0},148,0]
[{"$f":"'J1-1B'!P18","v":0},148,0]
[{"$f":"'J1-1B'!P19","v":0},148,{"$f":"A708*B708","v":0}]
[{"$f":"'J1-1B'!P20","v":0},148,0]
[{"$f":"'J1-1B'!P21","v":0},148,0]
[{"$f":"'J1-1B'!P22","v":0},148,0]
[{"$f":"'J1-1B'!P23","v":0},148,0]
[{"$f":"'J1-1B'!P24","v":0},148,0]
[{"$f":"'J1-1B'!P25","v":0},148,0]
[{"$f":"'J1-1B'!P26","v":0},148,0]
[{"$f":"'J1-1B'!P27","v":0},148,0]
[{"$f":"'J1-1B'!P28","v":0},148,0]
[{"$f":"'J1-1B'!P29","v":0},148,0]
[{"$f":"'J1-1B'!P30","v":0},148,0]
[{"$f":"'J1-1B'!P31","v":0},319,0]
[{"$f":"'J1-1B'!P32","v":0},319,0]
[{"$f":"'J1-1B'!P33","v":0},319,0]
[{"$f":"'J1-1B'!P34","v":0},319,0]
[{"$f":"'J1-1B'!P35","v":0},2727,0]
[{"$f":"'J1-1B'!Q11","v":0},773,0]
[{"$f":"'J1-1B'!Q12","v":0},773,0]
[{"$f":"'J1-1B'!Q13","v":0},773,0]
[{"$f":"'J1-1B'!Q14","v":0},773,0]
[{"$f":"'J1-1B'!Q15","v":0},773,0]
[{"$f":"'J1-1B'!Q16","v":0},773,0]
[{"$f":"'J1-1B'!Q17","v":0},773,0]
[{"$f":"'J1-1B'!Q18","v":0},773,0]
[{"$f":"'J1-1B'!Q19","v":0},773,0]
[{"$f":"'J1-1B'!Q20","v":0},773,0]
[{"$f":"'J1-1B'!Q21","v":0},773,0]
[{"$f":"'J1-1B'!Q22","v":0},773,0]
[{"$f":"'J1-1B'!Q23","v":0},773,0]
[{"$f":"'J1-1B'!Q24","v":0},773,0]
[{"$f":"'J1-1B'!Q25","v":0},773,0]
[{"$f":"'J1-1B'!Q26","v":0},773,0]
[{"$f":"'J1-1B'!Q27","v":0},773,0]
[{"$f":"'J1-1B'!Q28","v":0},773,0]
[{"$f":"'J1-1B'!Q29","v":0},773,0]
[{"$f":"'J1-1B'!Q30","v":0},773,0]
[{"$f":"'J1-1B'!Q31","v":0},319,0]
[{"$f":"'J1-1B'!Q32","v":0},319,0]
[{"$f":"'J1-1B'!Q33","v":0},319,0]
[{"$f":"'J1-1B'!Q34","v":0},319,0]
[{"$f":"'J1-1B'!Q35","v":0},2727,0]
[{"$f":"'J1-1B'!Q42","v":0},377,0]
[{"$f":"'J1-1B'!Q43","v":0},377,0]
[{"$f":"'J1-1B'!Q44","v":0},377,0]
[{"$f":"'J1-1B'!Q45","v":0},377,0]
[{"$f":"'J1-1B'!Q46","v":0},377,0]
[{"$f":"'J1-1B'!Q47","v":0},1719,0]
[{"$f":"'J1-1B'!Q48","v":0},1719,0]
[{"$f":"'J1-1B'!Q49","v":0},1861,0]
[{"$f":"'J1-1B'!Q50","v":0},1861,0]
[{"$f":"'J1-1B'!R11","v":0},773,0]
[{"$f":"'J1-1B'!R12","v":0},773,0]
[{"$f":"'J1-1B'!R13","v":0},773,0]
[{"$f":"'J1-1B'!R14","v":0},773,0]
[{"$f":"'J1-1B'!R15","v":0},773,0]
[{"$f":"'J1-1B'!R16","v":0},773,0]
[{"$f":"'J1-1B'!R17","v":0},773,0]
[{"$f":"'J1-1B'!R18","v":0},773,0]
[{"$f":"'J1-1B'!R19","v":0},773,0]
[{"$f":"'J1-1B'!R20","v":0},773,0]
[{"$f":"'J1-1B'!R21","v":0},773,0]
[{"$f":"'J1-1B'!R22","v":0},773,0]
[{"$f":"'J1-1B'!R23","v":0},773,0]
[{"$f":"'J1-1B'!R24","v":0},773,{"$f":"A772*B772","v":0}]
[{"$f":"'J1-1B'!R25","v":0},773,0]
[{"$f":"'J1-1B'!R26","v":0},773,0]
[{"$f":"'J1-1B'!R27","v":0},773,0]
[{"$f":"'J1-1B'!R28","v":0},773,0]
[{"$f":"'J1-1B'!R29","v":0},773,0]
[{"$f":"'J1-1B'!R30","v":0},773,0]
[{"$f":"'J1-1B'!R31","v":0},319,0]
[{"$f":"'J1-1B'!R32","v":0},319,0]
[{"$f":"'J1-1B'!R33","v":0},319,0]
[{"$f":"'J1-1B'!R34","v":0},319,0]
[{"$f":"'J1-1B'!R35","v":0},2727,0]
[{"$f":"'J1-1B'!S11","v":0},148,0]
[{"$f":"'J1-1B'!S12","v":0},148,0]
[{"$f":"'J1-1B'!S13","v":0},148,0]
[{"$f":"'J1-1B'!S14","v":0},148,0]
[{"$f":"'J1-1B'!S15","v":0},148,0]
[{"$f":"'J1-1B'!S16","v":0},148,0]
[{"$f":"'J1-1B'!S17","v":0},148,0]
[{"$f":"'J1-1B'!S18","v":0},148,0]
[{"$f":"'J1-1B'!S19","v":0},148,0]
[{"$f":"'J1-1B'!S20","v":0},148,0]
[{"$f":"'J1-1B'!S21","v":0},148,0]
[{"$f":"'J1-1B'!S22","v":0},148,0]
[{"$f":"'J1-1B'!S23","v":0},148,0]
[{"$f":"'J1-1B'!S24","v":0},148,0]
[{"$f":"'J1-1B'!S25","v":0},148,0]
[{"$f":"'J1-1B'!S26","v":0},148,0]
[{"$f":"'J1-1B'!S27","v":0},148,0]
[{"$f":"'J1-1B'!S28","v":0},148,0]
[{"$f":"'J1-1B'!S29","v":0},148,0]
[{"$f":"'J1-1B'!S30","v":0},148,0]
[{"$f":"'J1-1B'!S31","v":0},319,0]
[{"$f":"'J1-1B'!S32","v":0},319,0]
[{"$f":"'J1-1B'!S33","v":0},319,0]
[{"$f":"'J1-1B'!S34","v":0},319,0]
[{"$f":"'J1-1B'!S35","v":0},2727,0]
[{"$f":"'J1-1B'!S42","v":0},377,0]
[{"$f":"'J1-1B'!S43","v":0},377,0]
[{"$f":"'J1-1B'!S44","v":0},377,0]
[{"$f":"'J1-1B'!S45","v":0},377,0]
[{"$f":"'J1-1B'!S46","v":0},377,0]
[{"$f":"'J1-1B'!S47","v":0},1719,0]
[{"$f":"'J1-1B'!S48","v":0},1719,0]
[{"$f":"'J1-1B'!S49","v":0},1861,0]
[{"$f":"'J1-1B'!S50","v":0},1861,0]
[{"$f":"'J1-1B'!T11","v":0},148,0]
[{"$f":"'J1-1B'!T12","v":0},148,0]
[{"$f":"'J1-1B'!T13","v":0},148,0]
[{"$f":"'J1-1B'!T14","v":0},148,0]
[{"$f":"'J1-1B'!T15","v":0},148,0]
[{"$f":"'J1-1B'!T16","v":0},148,0]
[{"$f":"'J1-1B'!T17","v":0},148,0]
[{"$f":"'J1-1B'!T18","v":0},148,0]
[{"$f":"'J1-1B'!T19","v":0},148,0]
[{"$f":"'J1-1B'!T20","v":0},148,0]
[{"$f":"'J1-1B'!T21","v":0},148,0]
[{"$f":"'J1-1B'!T22","v":0},148,0]
[{"$f":"'J1-1B'!T23","v":0},148,0]
[{"$f":"'J1-1B'!T24","v":0},148,0]
[{"$f":"'J1-1B'!T25","v":0},148,0]
[{"$f":"'J1-1B'!T26","v":0},148,0]
[{"$f":"'J1-1B'!T27","v":0},148,0]
[{"$f":"'J1-1B'!T28","v":0},148,0]
[{"$f":"'J1-1B'!T29","v":0},148,{"$f":"A836*B836","v":0}]
[{"$f":"'J1-1B'!T30","v":0},148,0]
[{"$f":"'J1-1B'!T31","v":0},319,0]
[{"$f":"'J1-1B'!T32","v":0},319,0]
[{"$f":"'J1-1B'!T33","v":0},319,0]
[{"$f":"'J1-1B'!T34","v":0},319,0]
[{"$f":"'J1-1B'!T35","v":0},2727,0]
[{"$f":"'J1-1K'!E10","v":0},0,0]
[{"$f":"'J1-1K'!E11","v":0},0,0]
[{"$f":"'J1-1K'!E12","v":0},0,0]
[{"$f":"'J1-1K'!E13","v":0},0,0]
[{"$f":"'J1-1K'!E14","v":0},0,0]
[{"$f":"'J1-1K'!E15","v":0},0,0]
[{"$f":"'J1-1K'!E16","v":0},0,0]
[{"$f":"'J1-1K'!E17","v":0},0,0]
[{"$f":"'J1-1K'!E18","v":0},0,0]
[{"$f":"'J1-1K'!E19","v":0},0,0]
[{"$f":"'J1-1K'!E20","v":0},0,0]
[{"$f":"'J1-1K'!E21","v":0},0,0]
[{"$f":"'J1-1K'!F10","v":0},0,0]
[{"$f":"'J1-1K'!F11","v":0},0,0]
[{"$f":"'J1-1K'!F12","v":0},0,0]
[{"$f":"'J1-1K'!F13","v":0},0,0]
[{"$f":"'J1-1K'!F14","v":0},0,0]
[{"$f":"'J1-1K'!F15","v":0},0,0]
[{"$f":"'J1-1K'!F16","v":0},0,0]
[{"$f":"'J1-1K'!F17","v":0},0,0]
[{"$f":"'J1-1K'!F18","v":0},0,0]
[{"$f":"'J1-1K'!F19","v":0},0,0]
[{"$f":"'J1-1K'!F20","v":0},0,0]
[{"$f":"'J1-1K'!F21","v":0},0,0]
[{"$f":"'J1-1K'!G10","v":0},0,0]
[{"$f":"'J1-1K'!G11","v":0},0,0]
[{"$f":"'J1-1K'!G12","v":0},0,0]
[{"$f":"'J1-1K'!G13","v":0},0,0]
[{"$f":"'J1-1K'!G14","v":0},0,0]
[{"$f":"'J1-1K'!G15","v":0},0,0]
[{"$f":"'J1-1K'!G16","v":0},0,0]
[{"$f":"'J1-1K'!G17","v":0},0,0]
[{"$f":"'J1-1K'!G18","v":0},0,0]
[{"$f":"'J1-1K'!G19","v":0},0,0]
[{"$f":"'J1-1K'!G20","v":0},0,0]
[{"$f":"'J1-1K'!G21","v":0},0,0]
[{"$f":"'J1-1K'!H10","v":0},0,0]
[{"$f":"'J1-1K'!H11","v":0},0,0]
[{"$f":"'J1-1K'!H12","v":0},0,0]
[{"$f":"'J1-1K'!H13","v":0},0,0]
[{"$f":"'J1-1K'!H14","v":0},0,0]
[{"$f":"'J1-1K'!H15","v":0},0,0]
[{"$f":"'J1-1K'!H16","v":0},0,0]
[{"$f":"'J1-1K'!H17","v":0},0,0]
[{"$f":"'J1-1K'!H18","v":0},0,0]
[{"$f":"'J1-1K'!H19","v":0},0,0]
[{"$f":"'J1-1K'!H20","v":0},0,0]
[{"$f":"'J1-1K'!H21","v":0},0,0]
[{"$f":"'J1-1K'!I10","v":0},0,0]
[{"$f":"'J1-1K'!I11","v":0},0,0]
[{"$f":"'J1-1K'!I12","v":0},0,0]
[{"$f":"'J1-1K'!I13","v":0},0,0]
[{"$f":"'J1-1K'!I14","v":0},0,0]
[{"$f":"'J1-1K'!I15","v":0},0,0]
[{"$f":"'J1-1K'!I16","v":0},0,0]
[{"$f":"'J1-1K'!I17","v":0},0,0]
[{"$f":"'J1-1K'!I18","v":0},0,0]
[{"$f":"'J1-1K'!I19","v":0},0,{"$f":"A900*B900","v":0}]
[{"$f":"'J1-1K'!I20","v":0},0,0]
[{"$f":"'J1-1K'!I21","v":0},0,0]
[{"$f":"'J1-1K'!J10","v":0},0,0]
[{"$f":"'J1-1K'!J11","v":0},0,0]
[{"$f":"'J1-1K'!J12","v":0},0,0]
[{"$f":"'J1-1K'!J13","v":0},0,0]
[{"$f":"'J1-1K'!J14","v":0},0,0]
[{"$f":"'J1-1K'!J15","v":0},0,0]
[{"$f":"'J1-1K'!J16","v":0},0,0]
[{"$f":"'J1-1K'!J17","v":0},0,0]
[{"$f":"'J1-1K'!J18","v":0},0,0]
[{"$f":"'J1-1K'!J19","v":0},0,0]
[{"$f":"'J1-1K'!J20","v":0},0,0]
[{"$f":"'J1-1K'!J21","v":0},0,0]
[{"$f":"'J1-2A'!E10","v":0},15704,0]
[{"$f":"'J1-2A'!E11","v":0},15704,0]
[{"$f":"'J1-2A'!E12","v":0},15704,0]
[{"$f":"'J1-2A'!E13","v":0},15704,0]
[{"$f":"'J1-2A'!E14","v":0},15704,0]
[{"$f":"'J1-2A'!E15","v":0},15704,0]
[{"$f":"'J1-2A'!E16","v":0},15704,0]
[{"$f":"'J1-2A'!E17","v":0},15704,0]
[{"$f":"'J1-2A'!E18","v":0},15704,0]
[{"$f":"'J1-2A'!E19","v":0},17948,0]
[{"$f":"'J1-2A'!E20","v":0},17948,0]
[{"$f":"'J1-2A'!E21","v":0},17948,0]
[{"$f":"'J1-2A'!E22","v":0},17948,0]
[{"$f":"'J1-2A'!E23","v":0},15704,0]
[{"$f":"'J1-2A'!E24","v":0},15704,0]
[{"$f":"'J1-2A'!E25","v":0},15704,0]
[{"$f":"'J1-2A'!E26","v":0},15704,0]
[{"$f":"'J1-2A'!E27","v":0},15704,0]
[{"$f":"'J1-2A'!E28","v":0},15704,0]
[{"$f":"'J1-2A'!E29","v":0},25212,0]
[{"$f":"'J1-2A'!E30","v":0},25212,0]
[{"$f":"'J1-2A'!E31","v":0},10777,0]
[{"$f":"'J1-2A'!E32","v":0},2139,0]
[{"$f":"'J1-2A'!E33","v":0},10777,0]
[{"$f":"'J1-2A'!E34","v":0},2139,0]
[{"$f":"'J1-2A'!E36","v":0},25212,0]
[{"$f":"'J1-2A'!E41","v":0},1968,0]
[{"$f":"'J1-2A'!E42","v":0},1968,0]
[{"$f":"'J1-2A'!E43","v":0},1968,0]
[{"$f":"'J1-2A'!E44","v":0},5947,0]
[{"$f":"'J1-2A'!E45","v":0},5947,0]
[{"$f":"'J1-2A'!E46","v":0},5947,0]
[{"$f":"'J1-2A'!E47","v":0},5947,0]
[{"$f":"'J1-2A'!E48","v":0},5947,0]
[{"$f":"'J1-2A'!E49","v":0},4585,0]
[{"$f":"'J1-2A'!E50","v":0},4585,0]
[{"$f":"'J1-2A'!E51","v":0},1861,0]
[{"$f":"'J1-2A'!E52","v":0},25212,0]
[{"$f":"'J1-2A'!F10","v":0},15704,0]
[{"$f":"'J1-2A'!F11","v":0},15704,0]
[{"$f":"'J1-2A'!F12","v":0},15704,0]
[{"$f":"'J1-2A'!F13","v":0},15704,0]
[{"$f":"'J1-2A'!F14","v":0},15704,0]
[{"$f":"'J1-2A'!F15","v":0},15704,0]
[{"$f":"'J1-2A'!F16","v":0},15704,0]
[{"$f":"'J1-2A'!F17","v":0},15704,0]
[{"$f":"'J1-2A'!F18","v":0},15704,0]
[{"$f":"'J1-2A'!F19","v":0},17948,0]
[{"$f":"'J1-2A'!F20","v":0},17948,0]
[{"$f":"'J1-2A'!F21","v":0},17948,{"$f":"A964*B964","v":0}]
[{"$f":"'J1-2A'!F22","v":0},17948,0]
[{"$f":"'J1-2A'!F23","v":0},15704,0]
[{"$f":"'J1-2A'!F24","v":0},15704,0]
[{"$f":"'J1-2A'!F25","v":0},15704,0]
[{"$f":"'J1-2A'!F26","v":0},15704,0]
[{"$f":"'J1-2A'!F27","v":0},15704,0]
[{"$f":"'J1-2A'!F28","v":0},15704,0]
[{"$f":"'J1-2A'!F29","v":0},25212,0]
[{"$f":"'J1-2A'!F30","v":0},25212,0]
[{"$f":"'J1-2A'!F31","v":0},10777,0]
[{"$f":"'J1-2A'!F32","v":0},2139,0]
[{"$f":"'J1-2A'!F33","v":0},10777,0]
[{"$f":"'J1-2A'!F34","v":0},2139,0]
[{"$f":"'J1-2A'!F36","v":0},25212,0]
[{"$f":"'J1-2A'!G10","v":0},15704,0]
[{"$f":"'J1-2A'!G11","v":0},15704,0]
[{"$f":"'J1-2A'!G12","v":0},15704,0]
[{"$f":"'J1-2A'!G13","v":0},15704,0]
[{"$f":"'J1-2A'!G14","v":0},15704,0]
[{"$f":"'J1-2A'!G15","v":0},15704,0]
[{"$f":"'J1-2A'!G16","v":0},15704,0]
[{"$f":"'J1-2A'!G17","v":0},15704,0]
[{"$f":"'J1-2A'!G18","v":0},15704,0]
[{"$f":"'J1-2A'!G19","v":0},17948,0]
[{"$f":"'J1-2A'!G20","v":0},17948,0]
[{"$f":"'J1-2A'!G21","v":0},17948,0]
[{"$f":"'J1-2A'!G22","v":0},17948,0]
[{"$f":"'J1-2A'!G23","v":0},15704,0]
[{"$f":"'J1-2A'!G24","v":0},15704,0]
[{"$f":"'J1-2A'!G25","v":0},15704,0]
[{"$f":"'J1-2A'!G26","v":0},15704,0]
[{"$f":"'J1-2A'!G27","v":0},15704,0]
[{"$f":"'J1-2A'!G28","v":0},15704,0]
[{"$f":"'J1-2A'!G29","v":0},25212,0]
[{"$f":"'J1-2A'!G30","v":0},25212,0]
[{"$f":"'J1-2A'!G31","v":0},10777,0]
[{"$f":"'J1-2A'!G32","v":0},2139,0]
[{"$f":"'J1-2A'!G33","v":0},10777,0]
[{"$f":"'J1-2A'!G34","v":0},2139,0]
[{"$f":"'J1-2A'!G36","v":0},25212,0]
[{"$f":"'J1-2A'!G41","v":0},1968,0]
[{"$f":"'J1-2A'!G42","v":0},1968,0]
[{"$f":"'J1-2A'!G43","v":0},1968,0]
[{"$f":"'J1-2A'!G44","v":0},5947,0]
[{"$f":"'J1-2A'!G45","v":0},5947,0]
[{"$f":"'J1-2A'!G46","v":0},5947,0]
[{"$f":"'J1-2A'!G47","v":0},5947,0]
[{"$f":"'J1-2A'!G48","v":0},5947,0]
[{"$f":"'J1-2A'!G49","v":0},4585,0]
[{"$f":"'J1-2A'!G50","v":0},4585,0]
[{"$f":"'J1-2A'!G51","v":0},1861,0]
[{"$f":"'J1-2A'!G52","v":0},25212,0]
[{"$f":"'J1-2A'!H10","v":0},15704,0]
[{"$f":"'J1-2A'!H11","v":0},15704,0]
[{"$f":"'J1-2A'!H12","v":0},15704,0]
[{"$f":"'J1-2A'!H13","v":0},15704,0]
[{"$f":"'J1-2A'!H14","v":0},15704,0]
[{"$f":"'J1-2A'!H15","v":0},15704,0]
[{"$f":"'J1-2A'!H16","v":0},15704,0]
[{"$f":"'J1-2A'!H17","v":0},15704,0]
[{"$f":"'J1-2A'!H18","v":0},15704,0]
[{"$f":"'J1-2A'!H19","v":0},17948,0]
[{"$f":"'J1-2A'!H20","v":0},17948,0]
[{"$f":"'J1-2A'!H21","v":0},17948,{"$f":"A1028*B1028","v":0}]
[{"$f":"'J1-2A'!H22","v":0},17948,0]
[{"$f":"'J1-2A'!H23","v":0},15704,0]
[{"$f":"'J1-2A'!H24","v":0},15704,0]
[{"$f":"'J1-2A'!H25","v":0},15704,0]
[{"$f":"'J1-2A'!H26","v":0},15704,0]
[{"$f":"'J1-2A'!H27","v":0},15704,0]
[{"$f":"'J1-2A'!H28","v":0},15704,0]
[{"$f":"'J1-2A'!H29","v":0},25212,0]
[{"$f":"'J1-2A'!H30","v":0},25212,0]
[{"$f":"'J1-2A'!H31","v":0},10777,0]
[{"$f":"'J1-2A'!H32","v":0},2139,0]
[{"$f":"'J1-2A'!H33","v":0},10777,0]
[{"$f":"'J1-2A'!H34","v":0},2139,0]
[{"$f":"'J1-2A'!H36","v":0},25212,0]
[{"$f":"'J1-2A'!I10","v":0},11850]
[{"$f":"'J1-2A'!I11","v":0},17970]
[{"$f":"'J1-2A'!I12","v":0},20734]
[{"$f":"'J1-2A'!I13","v":0},16843,0]
[{"$f":"'J1-2A'!I14","v":0},16843,0]
[{"$f":"'J1-2A'!I15","v":0},16843,0]
[{"$f":"'J1-2A'!I16","v":0},16843,0]
[{"$f":"'J1-2A'!I17","v":0},16843,0]
[{"$f":"'J1-2A'!I18","v":0},16843,0]
[{"$f":"'J1-2A'!I19","v":0},17948,0]
[{"$f":"'J1-2A'!I20","v":0},17948,0]
[{"$f":"'J1-2A'!I21","v":0},17948,0]
[{"$f":"'J1-2A'!I22","v":0},17948,0]
[{"$f":"'J1-2A'!I23","v":0},16843,0]
[{"$f":"'J1-2A'!I24","v":0},16843,0]
[{"$f":"'J1-2A'!I25","v":0},16843,0]
[{"$f":"'J1-2A'!I26","v":0},16843,0]
[{"$f":"'J1-2A'!I27","v":0},16843,0]
[{"$f":"'J1-2A'!I28","v":0},16843,0]
[{"$f":"'J1-2A'!I29","v":0},25212,0]
[{"$f":"'J1-2A'!I30","v":0},25212,0]
[{"$f":"'J1-2A'!I31","v":0},4017,0]
[{"$f":"'J1-2A'!I32","v":0},2139,0]
[{"$f":"'J1-2A'!I33","v":0},4017,0]
[{"$f":"'J1-2A'!I34","v":0},2139,0]
[{"$f":"'J1-2A'!I35","v":0},7879,0]
[{"$f":"'J1-2A'!I36","v":0},25212,0]
[{"$f":"'J1-2A'!I41","v":0},1968,0]
[{"$f":"'J1-2A'!I42","v":0},1968,0]
[{"$f":"'J1-2A'!I43","v":0},1968,0]
[{"$f":"'J1-2A'!I44","v":0},5947,0]
[{"$f":"'J1-2A'!I45","v":0},5947,0]
[{"$f":"'J1-2A'!I46","v":0},5947,0]
[{"$f":"'J1-2A'!I47","v":0},5947,0]
[{"$f":"'J1-2A'!I48","v":0},5947,0]
[{"$f":"'J1-2A'!I49","v":0},4585,0]
[{"$f":"'J1-2A'!I50","v":0},4585,0]
[{"$f":"'J1-2A'!I51","v":0},1861,0]
[{"$f":"'J1-2A'!I52","v":0},25212,0]
[{"$f":"'J1-2A'!J10","v":0},11850]
[{"$f":"'J1-2A'!J11","v":0},17970]
[{"$f":"'J1-2A'!J12","v":0},20734]
[{"$f":"'J1-2A'!J13","v":0},16843,0]
[{"$f":"'J1-2A'!J14","v":0},16843,0]
[{"$f":"'J1-2A'!J15","v":0},16843,0]
[{"$f":"'J1-2A'!J16","v":0},16843,0]
[{"$f":"'J1-2A'!J17","v":0},16843,0]
[{"$f":"'J1-2A'!J18","v":0},16843,0]
[{"$f":"'J1-2A'!J19","v":0},17948,0]
[{"$f":"'J1-2A'!J20","v":0},17948,{"$f":"A1092*B1092","v":0}]
[{"$f":"'J1-2A'!J21","v":0},17948,0]
[{"$f":"'J1-2A'!J22","v":0},17948,0]
[{"$f":"'J1-2A'!J23","v":0},16843,0]
[{"$f":"'J1-2A'!J24","v":0},16843,0]
[{"$f":"'J1-2A'!J25","v":0},16843,0]
[{"$f":"'J1-2A'!J26","v":0},16843,0]
[{"$f":"'J1-2A'!J27","v":0},16843,0]
[{"$f":"'J1-2A'!J28","v":0},16843,0]
[{"$f":"'J1-2A'!J29","v":0},25212,0]
[{"$f":"'J1-2A'!J30","v":0},25212,0]
[{"$f":"'J1-2A'!J31","v":0},4017,0]
[{"$f":"'J1-2A'!J32","v":0},2139,0]
[{"$f":"'J1-2A'!J33","v":0},4017,0]
[{"$f":"'J1-2A'!J34","v":0},2139,0]
[{"$f":"'J1-2A'!J35","v":0},7879,0]
[{"$f":"'J1-2A'!J36","v":0},25212,0]
[{"$f":"'J1-2A'!K10","v":0},3312]
[{"$f":"'J1-2A'!K11","v":0},9433]
[{"$f":"'J1-2A'!K12","v":0},12197]
[{"$f":"'J1-2A'!K13","v":0},16843,0]
[{"$f":"'J1-2A'!K14","v":0},16843,0]
[{"$f":"'J1-2A'!K15","v":0},16843,0]
[{"$f":"'J1-2A'!K16","v":0},16843,0]
[{"$f":"'J1-2A'!K17","v":0},16843,0]
[{"$f":"'J1-2A'!K18","v":0},16843,0]
[{"$f":"'J1-2A'!K19","v":0},17948,0]
[{"$f":"'J1-2A'!K20","v":0},17948,0]
[{"$f":"'J1-2A'!K21","v":0},17948,0]
[{"$f":"'J1-2A'!K22","v":0},17948,0]
[{"$f":"'J1-2A'!K23","v":0},16843,0]
[{"$f":"'J1-2A'!K24","v":0},16843,0]
[{"$f":"'J1-2A'!K25","v":0},16843,0]
[{"$f":"'J1-2A'!K26","v":0},16843,0]
[{"$f":"'J1-2A'!K27","v":0},16843,0]
[{"$f":"'J1-2A'!K28","v":0},16843,0]
[{"$f":"'J1-2A'!K29","v":0},25212,0]
[{"$f":"'J1-2A'!K30","v":0},25212,0]
[{"$f":"'J1-2A'!K31","v":0},4017,0]
[{"$f":"'J1-2A'!K32","v":0},2139,0]
[{"$f":"'J1-2A'!K33","v":0},4017,0]
[{"$f":"'J1-2A'!K34","v":0},2139,0]
[{"$f":"'J1-2A'!K35","v":0},7879,0]
[{"$f":"'J1-2A'!K36","v":0},25212,0]
[{"$f":"'J1-2A'!K41","v":0},1968,0]
[{"$f":"'J1-2A'!K42","v":0},1968,0]
[{"$f":"'J1-2A'!K43","v":0},1968,0]
[{"$f":"'J1-2A'!K44","v":0},5947,0]
[{"$f":"'J1-2A'!K45","v":0},5947,0]
[{"$f":"'J1-2A'!K46","v":0},5947,0]
[{"$f":"'J1-2A'!K47","v":0},5947,0]
[{"$f":"'J1-2A'!K48","v":0},5947,0]
[{"$f":"'J1-2A'!K49","v":0},4585,0]
[{"$f":"'J1-2A'!K50","v":0},4585,0]
[{"$f":"'J1-2A'!K51","v":0},1861,0]
[{"$f":"'J1-2A'!K52","v":0},25212,0]
[{"$f":"'J1-2A'!L10","v":0},3312]
[{"$f":"'J1-2A'!L11","v":0},9433]
[{"$f":"'J1-2A'!L12","v":0},12197]
[{"$f":"'J1-2A'!L13","v":0},16843,0]
[{"$f":"'J1-2A'!L14","v":0},16843,0]
[{"$f":"'J1-2A'!L15","v":0},16843,0]
[{"$f":"'J1-2A'!L16","v":0},16843,0]
[{"$f":"'J1-2A'!L17","v":0},16843,0]
[{"$f":"'J1-2A'!L18","v":0},16843,{"$f":"A1156*B1156","v":0}]
[{"$f":"'J1-2A'!L19","v":0},17948,0]
[{"$f":"'J1-2A'!L20","v":0},17948,0]
[{"$f":"'J1-2A'!L21","v":0},17948,0]
[{"$f":"'J1-2A'!L22","v":0},17948,0]
[{"$f":"'J1-2A'!L23","v":0},16843,0]
[{"$f":"'J1-2A'!L24","v":0},16843,0]
[{"$f":"'J1-2A'!L25","v":0},16843,0]
[{"$f":"'J1-2A'!L26","v":0},16843,0]
[{"$f":"'J1-2A'!L27","v":0},16843,0]
[{"$f":"'J1-2A'!L28","v":0},16843,0]
[{"$f":"'J1-2A'!L29","v":0},25212,0]
[{"$f":"'J1-2A'!L30","v":0},25212,0]
[{"$f":"'J1-2A'!L31","v":0},4017,0]
[{"$f":"'J1-2A'!L32","v":0},2139,0]
[{"$f":"'J1-2A'!L33","v":0},4017,0]
[{"$f":"'J1-2A'!L34","v":0},2139,0]
[{"$f":"'J1-2A'!L35","v":0},7879,0]
[{"$f":"'J1-2A'!L36","v":0},25212,0]
[{"$f":"'J1-2A'!M10","v":0},11850,0]
[{"$f":"'J1-2A'!M11","v":0},17970,0]
[{"$f":"'J1-2A'!M12","v":0},20734,0]
[{"$f":"'J1-2A'!M13","v":0},16843,0]
[{"$f":"'J1-2A'!M14","v":0},16843,0]
[{"$f":"'J1-2A'!M15","v":0},16843,0]
[{"$f":"'J1-2A'!M16","v":0},16843,0]
[{"$f":"'J1-2A'!M17","v":0},16843,0]
[{"$f":"'J1-2A'!M18","v":0},16843,0]
[{"$f":"'J1-2A'!M19","v":0},17948,0]
[{"$f":"'J1-2A'!M20","v":0},17948,0]
[{"$f":"'J1-2A'!M21","v":0},17948,0]
[{"$f":"'J1-2A'!M22","v":0},17948,0]
[{"$f":"'J1-2A'!M23","v":0},16843,0]
[{"$f":"'J1-2A'!M24","v":0},16843,0]
[{"$f":"'J1-2A'!M25","v":0},16843,0]
[{"$f":"'J1-2A'!M26","v":0},16843,0]
[{"$f":"'J1-2A'!M27","v":0},16843,0]
[{"$f":"'J1-2A'!M28","v":0},16843,0]
[{"$f":"'J1-2A'!M29","v":0},25212,0]
[{"$f":"'J1-2A'!M30","v":0},25212,0]
[{"$f":"'J1-2A'!M31","v":0},4017,0]
[{"$f":"'J1-2A'!M32","v":0},2139,0]
[{"$f":"'J1-2A'!M33","v":0},4017,0]
[{"$f":"'J1-2A'!M34","v":0},2139,0]
[{"$f":"'J1-2A'!M35","v":0},7879,0]
[{"$f":"'J1-2A'!M36","v":0},25212,0]
[{"$f":"'J1-2A'!N10","v":0},11850,0]
[{"$f":"'J1-2A'!N11","v":0},17970,0]
[{"$f":"'J1-2A'!N12","v":0},20734,0]
[{"$f":"'J1-2A'!N13","v":0},16843,0]
[{"$f":"'J1-2A'!N14","v":0},16843,0]
[{"$f":"'J1-2A'!N15","v":0},16843,0]
[{"$f":"'J1-2A'!N16","v":0},16843,0]
[{"$f":"'J1-2A'!N17","v":0},16843,0]
[{"$f":"'J1-2A'!N18","v":0},16843,0]
[{"$f":"'J1-2A'!N19","v":0},17948,0]
[{"$f":"'J1-2A'!N20","v":0},17948,0]
[{"$f":"'J1-2A'!N21","v":0},17948,0]
[{"$f":"'J1-2A'!N22","v":0},17948,0]
[{"$f":"'J1-2A'!N23","v":0},16843,0]
[{"$f":"'J1-2A'!N24","v":0},16843,0]
[{"$f":"'J1-2A'!N25","v":0},16843,0]
[{"$f":"'J1-2A'!N26","v":0},16843,0]
[{"$f":"'J1-2A'!N27","v":0},16843,0]
[{"$f":"'J1-2A'!N28","v":0},16843,{"$f":"A1220*B1220","v":0}]
[{"$f":"'J1-2A'!N29","v":0},25212,0]
[{"$f":"'J1-2A'!N30","v":0},25212,0]
[{"$f":"'J1-2A'!N31","v":0},4017,0]
[{"$f":"'J1-2A'!N32","v":0},2139,0]
[{"$f":"'J1-2A'!N33","v":0},4017,0]
[{"$f":"'J1-2A'!N34","v":0},2139,0]
[{"$f":"'J1-2A'!N35","v":0},7879,0]
[{"$f":"'J1-2A'!N36","v":0},25212,0]
[{"$f":"'J1-2A'!O10","v":0},11850,0]
[{"$f":"'J1-2A'!O11","v":0},17970,0]
[{"$f":"'J1-2A'!O12","v":0},20734,0]
[{"$f":"'J1-2A'!O13","v":0},16843,0]
[{"$f":"'J1-2A'!O14","v":0},16843,0]
[{"$f":"'J1-2A'!O15","v":0},16843,0]
[{"$f":"'J1-2A'!O16","v":0},16843,0]
[{"$f":"'J1-2A'!O17","v":0},16843,0]
[{"$f":"'J1-2A'!O18","v":0},16843,0]
[{"$f":"'J1-2A'!O19","v":0},17948,0]
[{"$f":"'J1-2A'!O20","v":0},17948,0]
[{"$f":"'J1-2A'!O21","v":0},17948,0]
[{"$f":"'J1-2A'!O22","v":0},17948,0]
[{"$f":"'J1-2A'!O23","v":0},16843,0]
[{"$f":"'J1-2A'!O24","v":0},16843,0]
[{"$f":"'J1-2A'!O25","v":0},16843,0]
[{"$f":"'J1-2A'!O26","v":0},16843,0]
[{"$f":"'J1-2A'!O27","v":0},16843,0]
[{"$f":"'J1-2A'!O28","v":0},16843,0]
[{"$f":"'J1-2A'!O29","v":0},25212,0]
[{"$f":"'J1-2A'!O30","v":0},25212,0]
[{"$f":"'J1-2A'!O31","v":0},4017,0]
[{"$f":"'J1-2A'!O32","v":0},2139,0]
[{"$f":"'J1-2A'!O33","v":0},4017,0]
[{"$f":"'J1-2A'!O34","v":0},2139,0]
[{"$f":"'J1-2A'!O35","v":0},7879,0]
[{"$f":"'J1-2A'!O36","v":0},25212,0]
[{"$f":"'J1-2A'!P10","v":0},11850,0]
[{"$f":"'J1-2A'!P11","v":0},17970,0]
[{"$f":"'J1-2A'!P12","v":0},20734,0]
[{"$f":"'J1-2A'!P13","v":0},16843,0]
[{"$f":"'J1-2A'!P14","v":0},16843,0]
[{"$f":"'J1-2A'!P15","v":0},16843,0]
[{"$f":"'J1-2A'!P16","v":0},16843,0]
[{"$f":"'J1-2A'!P17","v":0},16843,0]
[{"$f":"'J1-2A'!P18","v":0},16843,0]
[{"$f":"'J1-2A'!P19","v":0},17948,0]
[{"$f":"'J1-2A'!P20","v":0},17948,0]
[{"$f":"'J1-2A'!P21","v":0},17948,0]
[{"$f":"'J1-2A'!P22","v":0},17948,0]
[{"$f":"'J1-2A'!P23","v":0},16843,0]
[{"$f":"'J1-2A'!P24","v":0},16843,0]
[{"$f":"'J1-2A'!P25","v":0},16843,0]
[{"$f":"'J1-2A'!P26","v":0},16843,0]
[{"$f":"'J1-2A'!P27","v":0},16843,0]
[{"$f":"'J1-2A'!P28","v":0},16843,0]
[{"$f":"'J1-2A'!P29","v":0},25212,0]
[{"$f":"'J1-2A'!P30","v":0},25212,0]
[{"$f":"'J1-2A'!P31","v":0},4017,0]
[{"$f":"'J1-2A'!P32","v":0},2139,0]
[{"$f":"'J1-2A'!P33","v":0},4017,0]
[{"$f":"'J1-2A'!P34","v":0},2139,0]
[{"$f":"'J1-2A'!P35","v":0},7879,0]
[{"$f":"'J1-2A'!P36","v":0},25212,0]
[{"$f":"'J1-2B'!E11","v":0},773,0]
[{"$f":"'J1-2B'!E12","v":0},773,{"$f":"A1284*B1284","v":0}]
[{"$f":"'J1-2B'!E13","v":0},773,0]
[{"$f":"'J1-2B'!E14","v":0},773,0]
[{"$f":"'J1-2B'!E15","v":0},773,0]
[{"$f":"'J1-2B'!E16","v":0},773,0]
[{"$f":"'J1-2B'!E17","v":0},773,0]
[{"$f":"'J1-2B'!E18","v":0},773,0]
[{"$f":"'J1-2B'!E19","v":0},773,0]
[{"$f":"'J1-2B'!E20","v":0},773,0]
[{"$f":"'J1-2B'!E21","v":0},773,0]
[{"$f":"'J1-2B'!E22","v":0},773,0]
[{"$f":"'J1-2B'!E23","v":0},773,0]
[{"$f":"'J1-2B'!E24","v":0},773,0]
[{"$f":"'J1-2B'!E25","v":0},773,0]
[{"$f":"'J1-2B'!E26","v":0},773,0]
[{"$f":"'J1-2B'!E27","v":0},773,0]
[{"$f":"'J1-2B'!E28","v":0},773,0]
[{"$f":"'J1-2B'!E29","v":0},773,0]
[{"$f":"'J1-2B'!E30","v":0},773,0]
[{"$f":"'J1-2B'!E31","v":0},319,0]
[{"$f":"'J1-2B'!E32","v":0},319,0]
[{"$f":"'J1-2B'!E33","v":0},319,0]
[{"$f":"'J1-2B'!E34","v":0},319,0]
[{"$f":"'J1-2B'!E35","v":0},2727,0]
[{"$f":"'J1-2B'!E42","v":0},377,0]
[{"$f":"'J1-2B'!E43","v":0},377,0]
[{"$f":"'J1-2B'!E44","v":0},377,0]
[{"$f":"'J1-2B'!E45","v":0},377,0]
[{"$f":"'J1-2B'!E46","v":0},377,0]
[{"$f":"'J1-2B'!E47","v":0},1719,0]
[{"$f":"'J1-2B'!E48","v":0},1719,0]
[{"$f":"'J1-2B'!E49","v":0},1861,0]
[{"$f":"'J1-2B'!E50","v":0},1861,0]
[{"$f":"'J1-2B'!F11","v":0},773,0]
[{"$f":"'J1-2B'!F12","v":0},773,0]
[{"$f":"'J1-2B'!F13","v":0},773,0]
[{"$f":"'J1-2B'!F14","v":0},773,0]
[{"$f":"'J1-2B'!F15","v":0},773,0]
[{"$f":"'J1-2B'!F16","v":0},773,0]
[{"$f":"'J1-2B'!F17","v":0},773,0]
[{"$f":"'J1-2B'!F18","v":0},773,0]
[{"$f":"'J1-2B'!F19","v":0},773,0]
[{"$f":"'J1-2B'!F20","v":0},773,0]
[{"$f":"'J1-2B'!F21","v":0},773,0]
[{"$f":"'J1-2B'!F22","v":0},773,0]
[{"$f":"'J1-2B'!F23","v":0},773,0]
[{"$f":"'J1-2B'!F24","v":0},773,0]
[{"$f":"'J1-2B'!F25","v":0},773,0]
[{"$f":"'J1-2B'!F26","v":0},773,0]
[{"$f":"'J1-2B'!F27","v":0},773,0]
[{"$f":"'J1-2B'!F28","v":0},773,0]
[{"$f":"'J1-2B'!F29","v":0},773,0]
[{"$f":"'J1-2B'!F30","v":0},773,0]
[{"$f":"'J1-2B'!F31","v":0},319,0]
[{"$f":"'J1-2B'!F32","v":0},319,0]
[{"$f":"'J1-2B'!F33","v":0},319,0]
[{"$f":"'J1-2B'!F34","v":0},319,0]
[{"$f":"'J1-2B'!F35","v":0},2727,0]
[{"$f":"'J1-2B'!G11","v":0},148,0]
[{"$f":"'J1-2B'!G12","v":0},148,0]
[{"$f":"'J1-2B'!G13","v":0},148,0]
[{"$f":"'J1-2B'!G14","v":0},148,0]
[{"$f":"'J1-2B'!G15","v":0},148,0]
[{"$f":"'J1-2B'!G16","v":0},148,0]
[{"$f":"'J1-2B'!G17","v":0},148,{"$f":"A1348*B1348","v":0}]
[{"$f":"'J1-2B'!G18","v":0},148,0]
[{"$f":"'J1-2B'!G19","v":0},148,0]
[{"$f":"'J1-2B'!G20","v":0},148,0]
[{"$f":"'J1-2B'!G21","v":0},148,0]
[{"$f":"'J1-2B'!G22","v":0},148,0]
[{"$f":"'J1-2B'!G23","v":0},148,0]
[{"$f":"'J1-2B'!G24","v":0},148,0]
[{"$f":"'J1-2B'!G25","v":0},148,0]
[{"$f":"'J1-2B'!G26","v":0},148,0]
[{"$f":"'J1-2B'!G27","v":0},148,0]
[{"$f":"'J1-2B'!G28","v":0},148,0]
[{"$f":"'J1-2B'!G29","v":0},148,0]
[{"$f":"'J1-2B'!G30","v":0},148,0]
[{"$f":"'J1-2B'!G31","v":0},319,0]
[{"$f":"'J1-2B'!G32","v":0},319,0]
[{"$f":"'J1-2B'!G33","v":0},319,0]
[{"$f":"'J1-2B'!G34","v":0},319,0]
[{"$f":"'J1-2B'!G35","v":0},2727,0]
[{"$f":"'J1-2B'!G42","v":0},377,0]
[{"$f":"'J1-2B'!G43","v":0},377,0]
[{"$f":"'J1-2B'!G44","v":0},377,0]
[{"$f":"'J1-2B'!G45","v":0},377,0]
[{"$f":"'J1-2B'!G46","v":0},377,0]
[{"$f":"'J1-2B'!G47","v":0},1719,0]
[{"$f":"'J1-2B'!G48","v":0},1719,0]
[{"$f":"'J1-2B'!G49","v":0},1861,0]
[{"$f":"'J1-2B'!G50","v":0},1861,0]
[{"$f":"'J1-2B'!H11","v":0},148,0]
[{"$f":"'J1-2B'!H12","v":0},148,0]
[{"$f":"'J1-2B'!H13","v":0},148,0]
[{"$f":"'J1-2B'!H14","v":0},148,0]
[{"$f":"'J1-2B'!H15","v":0},148,0]
[{"$f":"'J1-2B'!H16","v":0},148,0]
[{"$f":"'J1-2B'!H17","v":0},148,0]
[{"$f":"'J1-2B'!H18","v":0},148,0]
[{"$f":"'J1-2B'!H19","v":0},148,0]
[{"$f":"'J1-2B'!H20","v":0},148,0]
[{"$f":"'J1-2B'!H21","v":0},148,0]
[{"$f":"'J1-2B'!H22","v":0},148,0]
[{"$f":"'J1-2B'!H23","v":0},148,0]
[{"$f":"'J1-2B'!H24","v":0},148,0]
[{"$f":"'J1-2B'!H25","v":0},148,0]
[{"$f":"'J1-2B'!H26","v":0},148,0]
[{"$f":"'J1-2B'!H27","v":0},148,0]
[{"$f":"'J1-2B'!H28","v":0},148,0]
[{"$f":"'J1-2B'!H29","v":0},148,0]
[{"$f":"'J1-2B'!H30","v":0},148,0]
[{"$f":"'J1-2B'!H31","v":0},319,0]
[{"$f":"'J1-2B'!H32","v":0},319,0]
[{"$f":"'J1-2B'!H33","v":0},319,0]
[{"$f":"'J1-2B'!H34","v":0},319,0]
[{"$f":"'J1-2B'!H35","v":0},2727,0]
[{"$f":"'J1-2B'!I11","v":0},773,0]
[{"$f":"'J1-2B'!I12","v":0},773,0]
[{"$f":"'J1-2B'!I13","v":0},773,0]
[{"$f":"'J1-2B'!I14","v":0},773,0]
[{"$f":"'J1-2B'!I15","v":0},773,0]
[{"$f":"'J1-2B'!I16","v":0},773,0]
[{"$f":"'J1-2B'!I17","v":0},773,0]
[{"$f":"'J1-2B'!I18","v":0},773,0]
[{"$f":"'J1-2B'!I19","v":0},773,0]
[{"$f":"'J1-2B'!I20","v":0},773,0]
[{"$f":"'J1-2B'!I21","v":0},773,0]
[{"$f":"'J1-2B'!I22","v":0},773,{"$f":"A1412*B1412","v":0}]
[{"$f":"'J1-2B'!I23","v":0},773,0]
[{"$f":"'J1-2B'!I24","v":0},773,0]
[{"$f":"'J1-2B'!I25","v":0},773,0]
[{"$f":"'J1-2B'!I26","v":0},773,0]
[{"$f":"'J1-2B'!I27","v":0},773,0]
[{"$f":"'J1-2B'!I28","v":0},773,0]
[{"$f":"'J1-2B'!I29","v":0},773,0]
[{"$f":"'J1-2B'!I30","v":0},773,0]
[{"$f":"'J1-2B'!I31","v":0},319,0]
[{"$f":"'J1-2B'!I32","v":0},319,0]
[{"$f":"'J1-2B'!I33","v":0},319,0]
[{"$f":"'J1-2B'!I34","v":0},319,0]
[{"$f":"'J1-2B'!I35","v":0},2727,0]
[{"$f":"'J1-2B'!I42","v":0},377,0]
[{"$f":"'J1-2B'!I43","v":0},377,0]
[{"$f":"'J1-2B'!I44","v":0},377,0]
[{"$f":"'J1-2B'!I45","v":0},377,0]
[{"$f":"'J1-2B'!I46","v":0},377,0]
[{"$f":"'J1-2B'!I47","v":0},1719,0]
[{"$f":"'J1-2B'!I48","v":0},1719,0]
[{"$f":"'J1-2B'!I49","v":0},1861,0]
[{"$f":"'J1-2B'!I50","v":0},1861,0]
[{"$f":"'J1-2B'!J11","v":0},773,0]
[{"$f":"'J1-2B'!J12","v":0},773,0]
[{"$f":"'J1-2B'!J13","v":0},773,0]
[{"$f":"'J1-2B'!J14","v":0},773,0]
[{"$f":"'J1-2B'!J15","v":0},773,0]
[{"$f":"'J1-2B'!J16","v":0},773,0]
[{"$f":"'J1-2B'!J17","v":0},773,0]
[{"$f":"'J1-2B'!J18","v":0},773,0]
[{"$f":"'J1-2B'!J19","v":0},773,0]
[{"$f":"'J1-2B'!J20","v":0},773,0]
[{"$f":"'J1-2B'!J21","v":0},773,0]
[{"$f":"'J1-2B'!J22","v":0},773,0]
[{"$f":"'J1-2B'!J23","v":0},773,0]
[{"$f":"'J1-2B'!J24","v":0},773,0]
[{"$f":"'J1-2B'!J25","v":0},773,0]
[{"$f":"'J1-2B'!J26","v":0},773,0]
[{"$f":"'J1-2B'!J27","v":0},773,0]
[{"$f":"'J1-2B'!J28","v":0},773,0]
[{"$f":"'J1-2B'!J29","v":0},773,0]
[{"$f":"'J1-2B'!J30","v":0},773,0]
[{"$f":"'J1-2B'!J31","v":0},319,0]
[{"$f":"'J1-2B'!J32","v":0},319,0]
[{"$f":"'J1-2B'!J33","v":0},319,0]
[{"$f":"'J1-2B'!J34","v":0},319,0]
[{"$f":"'J1-2B'!J35","v":0},2727,0]
[{"$f":"'J1-2B'!K11","v":0},148,0]
[{"$f":"'J1-2B'!K12","v":0},148,0]
[{"$f":"'J1-2B'!K13","v":0},148,0]
[{"$f":"'J1-2B'!K14","v":0},148,0]
[{"$f":"'J1-2B'!K15","v":0},148,0]
[{"$f":"'J1-2B'!K16","v":0},148,0]
[{"$f":"'J1-2B'!K17","v":0},148,0]
[{"$f":"'J1-2B'!K18","v":0},148,0]
[{"$f":"'J1-2B'!K19","v":0},148,0]
[{"$f":"'J1-2B'!K20","v":0},148,0]
[{"$f":"'J1-2B'!K21","v":0},148,0]
[{"$f":"'J1-2B'!K22","v":0},148,0]
[{"$f":"'J1-2B'!K23","v":0},148,0]
[{"$f":"'J1-2B'!K24","v":0},148,0]
[{"$f":"'J1-2B'!K25","v":0},148,0]
[{"$f":"'J1-2B'!K26","v":0},148,0]
[{"$f":"'J1-2B'!K27","v":0},148,{"$f":"A1476*B1476","v":0}]
[{"$f":"'J1-2B'!K28","v":0},148,0]
[{"$f":"'J1-2B'!K29","v":0},148,0]
[{"$f":"'J1-2B'!K30","v":0},148,0]
[{"$f":"'J1-2B'!K31","v":0},319,0]
[{"$f":"'J1-2B'!K32","v":0},319,0]
[{"$f":"'J1-2B'!K33","v":0},319,0]
[{"$f":"'J1-2B'!K34","v":0},319,0]
[{"$f":"'J1-2B'!K35","v":0},2727,0]
[{"$f":"'J1-2B'!K42","v":0},377,0]
[{"$f":"'J1-2B'!K43","v":0},377,0]
[{"$f":"'J1-2B'!K44","v":0},377,0]
[{"$f":"'J1-2B'!K45","v":0},377,0]
[{"$f":"'J1-2B'!K46","v":0},377,0]
[{"$f":"'J1-2B'!K47","v":0},1719,0]
[{"$f":"'J1-2B'!K48","v":0},1719,0]
[{"$f":"'J1-2B'!K49","v":0},1861,0]
[{"$f":"'J1-2B'!K50","v":0},1861,0]
[{"$f":"'J1-2B'!L11","v":0},148,0]
[{"$f":"'J1-2B'!L12","v":0},148,0]
[{"$f":"'J1-2B'!L13","v":0},148,0]
[{"$f":"'J1-2B'!L14","v":0},148,0]
[{"$f":"'J1-2B'!L15","v":0},148,0]
[{"$f":"'J1-2B'!L16","v":0},148,0]
[{"$f":"'J1-2B'!L17","v":0},148,0]
[{"$f":"'J1-2B'!L18","v":0},148,0]
[{"$f":"'J1-2B'!L19","v":0},148,0]
[{"$f":"'J1-2B'!L20","v":0},148,0]
[{"$f":"'J1-2B'!L21","v":0},148,0]
[{"$f":"'J1-2B'!L22","v":0},148,0]
[{"$f":"'J1-2B'!L23","v":0},148,0]
[{"$f":"'J1-2B'!L24","v":0},148,0]
[{"$f":"'J1-2B'!L25","v":0},148,0]
[{"$f":"'J1-2B'!L26","v":0},148,0]
[{"$f":"'J1-2B'!L27","v":0},148,0]
[{"$f":"'J1-2B'!L28","v":0},148,0]
[{"$f":"'J1-2B'!L29","v":0},148,0]
[{"$f":"'J1-2B'!L30","v":0},148,0]
[{"$f":"'J1-2B'!L31","v":0},319,0]
[{"$f":"'J1-2B'!L32","v":0},319,0]
[{"$f":"'J1-2B'!L33","v":0},319,0]
[{"$f":"'J1-2B'!L34","v":0},319,0]
[{"$f":"'J1-2B'!L35","v":0},2727,0]
[{"$f":"'J1-2B'!M11","v":0},773,0]
[{"$f":"'J1-2B'!M12","v":0},773,0]
[{"$f":"'J1-2B'!M13","v":0},773,0]
[{"$f":"'J1-2B'!M14","v":0},773,0]
[{"$f":"'J1-2B'!M15","v":0},773,0]
[{"$f":"'J1-2B'!M16","v":0},773,0]
[{"$f":"'J1-2B'!M17","v":0},773,0]
[{"$f":"'J1-2B'!M18","v":0},773,0]
[{"$f":"'J1-2B'!M19","v":0},773,0]
[{"$f":"'J1-2B'!M20","v":0},773,0]
[{"$f":"'J1-2B'!M21","v":0},773,0]
[{"$f":"'J1-2B'!M22","v":0},773,0]
[{"$f":"'J1-2B'!M23","v":0},773,0]
[{"$f":"'J1-2B'!M24","v":0},773,0]
[{"$f":"'J1-2B'!M25","v":0},773,0]
[{"$f":"'J1-2B'!M26","v":0},773,0]
[{"$f":"'J1-2B'!M27","v":0},773,0]
[{"$f":"'J1-2B'!M28","v":0},773,0]
[{"$f":"'J1-2B'!M29","v":0},773,0]
[{"$f":"'J1-2B'!M30","v":0},773,0]
[{"$f":"'J1-2B'!M31","v":0},319,0]
[{"$f":"'J1-2B'!M32","v":0},319,{"$f":"A1540*B1540","v":0}]
[{"$f":"'J1-2B'!M33","v":0},319,0]
[{"$f":"'J1-2B'!M34","v":0},319,0]
[{"$f":"'J1-2B'!M35","v":0},2727,0]
[{"$f":"'J1-2B'!M42","v":0},377,0]
[{"$f":"'J1-2B'!M43","v":0},377,0]
[{"$f":"'J1-2B'!M44","v":0},377,0]
[{"$f":"'J1-2B'!M45","v":0},377,0]
[{"$f":"'J1-2B'!M46","v":0},377,0]
[{"$f":"'J1-2B'!M47","v":0},1719,0]
[{"$f":"'J1-2B'!M48","v":0},1719,0]
[{"$f":"'J1-2B'!M49","v":0},1861,0]
[{"$f":"'J1-2B'!M50","v":0},1861,0]
[{"$f":"'J1-2B'!N11","v":0},773,0]
[{"$f":"'J1-2B'!N12","v":0},773,0]
[{"$f":"'J1-2B'!N13","v":0},773,0]
[{"$f":"'J1-2B'!N14","v":0},773,0]
[{"$f":"'J1-2B'!N15","v":0},773,0]
[{"$f":"'J1-2B'!N16","v":0},773,0]
[{"$f":"'J1-2B'!N17","v":0},773,0]
[{"$f":"'J1-2B'!N18","v":0},773,0]
[{"$f":"'J1-2B'!N19","v":0},773,0]
[{"$f":"'J1-2B'!N20","v":0},773,0]
[{"$f":"'J1-2B'!N21","v":0},773,0]
[{"$f":"'J1-2B'!N22","v":0},773,0]
[{"$f":"'J1-2B'!N23","v":0},773,0]
[{"$f":"'J1-2B'!N24","v":0},773,0]
[{"$f":"'J1-2B'!N25","v":0},773,0]
[{"$f":"'J1-2B'!N26","v":0},773,0]
[{"$f":"'J1-2B'!N27","v":0},773,0]
[{"$f":"'J1-2B'!N28","v":0},773,0]
[{"$f":"'J1-2B'!N29","v":0},773,0]
[{"$f":"'J1-2B'!N30","v":0},773,0]
[{"$f":"'J1-2B'!N31","v":0},319,0]
[{"$f":"'J1-2B'!N32","v":0},319,0]
[{"$f":"'J1-2B'!N33","v":0},319,0]
[{"$f":"'J1-2B'!N34","v":0},319,0]
[{"$f":"'J1-2B'!N35","v":0},2727,0]
[{"$f":"'J1-2B'!O11","v":0},148,0]
[{"$f":"'J1-2B'!O12","v":0},148,0]
[{"$f":"'J1-2B'!O13","v":0},148,0]
[{"$f":"'J1-2B'!O14","v":0},148,0]
[{"$f":"'J1-2B'!O15","v":0},148,0]
[{"$f":"'J1-2B'!O16","v":0},148,0]
[{"$f":"'J1-2B'!O17","v":0},148,0]
[{"$f":"'J1-2B'!O18","v":0},148,0]
[{"$f":"'J1-2B'!O19","v":0},148,0]
[{"$f":"'J1-2B'!O20","v":0},148,0]
[{"$f":"'J1-2B'!O21","v":0},148,0]
[{"$f":"'J1-2B'!O22","v":0},148,0]
[{"$f":"'J1-2B'!O23","v":0},148,0]
[{"$f":"'J1-2B'!O24","v":0},148,0]
[{"$f":"'J1-2B'!O25","v":0},148,0]
[{"$f":"'J1-2B'!O26","v":0},148,0]
[{"$f":"'J1-2B'!O27","v":0},148,0]
[{"$f":"'J1-2B'!O28","v":0},148,0]
[{"$f":"'J1-2B'!O29","v":0},148,0]
[{"$f":"'J1-2B'!O30","v":0},148,0]
[{"$f":"'J1-2B'!O31","v":0},319,0]
[{"$f":"'J1-2B'!O32","v":0},319,0]
[{"$f":"'J1-2B'!O33","v":0},319,0]
[{"$f":"'J1-2B'!O34","v":0},319,0]
[{"$f":"'J1-2B'!O35","v":0},2727,0]
[{"$f":"'J1-2B'!O42","v":0},377,0]
[{"$f":"'J1-2B'!O43","v":0},377,{"$f":"A1604*B1604","v":0}]
[{"$f":"'J1-2B'!O44","v":0},377,0]
[{"$f":"'J1-2B'!O45","v":0},377,0]
[{"$f":"'J1-2B'!O46","v":0},377,0]
[{"$f":"'J1-2B'!O47","v":0},1719,0]
[{"$f":"'J1-2B'!O48","v":0},1719,0]
[{"$f":"'J1-2B'!O49","v":0},1861,0]
[{"$f":"'J1-2B'!O50","v":0},1861,0]
[{"$f":"'J1-2B'!P11","v":0},148,0]
[{"$f":"'J1-2B'!P12","v":0},148,0]
[{"$f":"'J1-2B'!P13","v":0},148,0]
[{"$f":"'J1-2B'!P14","v":0},148,0]
[{"$f":"'J1-2B'!P15","v":0},148,0]
[{"$f":"'J1-2B'!P16","v":0},148,0]
[{"$f":"'J1-2B'!P17","v":0},148,0]
[{"$f":"'J1-2B'!P18","v":0},148,0]
[{"$f":"'J1-2B'!P19","v":0},148,0]
[{"$f":"'J1-2B'!P20","v":0},148,0]
[{"$f":"'J1-2B'!P21","v":0},148,0]
[{"$f":"'J1-2B'!P22","v":0},148,0]
[{"$f":"'J1-2B'!P23","v":0},148,0]
[{"$f":"'J1-2B'!P24","v":0},148,0]
[{"$f":"'J1-2B'!P25","v":0},148,0]
[{"$f":"'J1-2B'!P26","v":0},148,0]
[{"$f":"'J1-2B'!P27","v":0},148,0]
[{"$f":"'J1-2B'!P28","v":0},148,0]
[{"$f":"'J1-2B'!P29","v":0},148,0]
[{"$f":"'J1-2B'!P30","v":0},148,0]
[{"$f":"'J1-2B'!P31","v":0},319,0]
[{"$f":"'J1-2B'!P32","v":0},319,0]
[{"$f":"'J1-2B'!P33","v":0},319,0]
[{"$f":"'J1-2B'!P34","v":0},319,0]
[{"$f":"'J1-2B'!P35","v":0},2727,0]
[{"$f":"'J1-2B'!Q11","v":0},773,0]
[{"$f":"'J1-2B'!Q12","v":0},773,0]
[{"$f":"'J1-2B'!Q13","v":0},773,0]
[{"$f":"'J1-2B'!Q14","v":0},773,0]
[{"$f":"'J1-2B'!Q15","v":0},773,0]
[{"$f":"'J1-2B'!Q16","v":0},773,0]
[{"$f":"'J1-2B'!Q17","v":0},773,0]
[{"$f":"'J1-2B'!Q18","v":0},773,0]
[{"$f":"'J1-2B'!Q19","v":0},773,0]
[{"$f":"'J1-2B'!Q20","v":0},773,0]
[{"$f":"'J1-2B'!Q21","v":0},773,0]
[{"$f":"'J1-2B'!Q22","v":0},773,0]
[{"$f":"'J1-2B'!Q23","v":0},773,0]
[{"$f":"'J1-2B'!Q24","v":0},773,0]
[{"$f":"'J1-2B'!Q25","v":0},773,0]
[{"$f":"'J1-2B'!Q26","v":0},773,0]
[{"$f":"'J1-2B'!Q27","v":0},773,0]
[{"$f":"'J1-2B'!Q28","v":0},773,0]
[{"$f":"'J1-2B'!Q29","v":0},773,0]
[{"$f":"'J1-2B'!Q30","v":0},773,0]
[{"$f":"'J1-2B'!Q31","v":0},319,0]
[{"$f":"'J1-2B'!Q32","v":0},319,0]
[{"$f":"'J1-2B'!Q33","v":0},319,0]
[{"$f":"'J1-2B'!Q34","v":0},319,0]
[{"$f":"'J1-2B'!Q35","v":0},2727,0]
[{"$f":"'J1-2B'!Q42","v":0},377,0]
[{"$f":"'J1-2B'!Q43","v":0},377,0]
[{"$f":"'J1-2B'!Q44","v":0},377,0]
[{"$f":"'J1-2B'!Q45","v":0},377,0]
[{"$f":"'J1-2B'!Q46","v":0},377,0]
[{"$f":"'J1-2B'!Q47","v":0},1719,0]
[{"$f":"'J1-2B'!Q48","v":0},1719,{"$f":"A1668*B1668","v":0}]
[{"$f":"'J1-2B'!Q49","v":0},1861,0]
[{"$f":"'J1-2B'!Q50","v":0},1861,0]
[{"$f":"'J1-2B'!R11","v":0},773,0]
[{"$f":"'J1-2B'!R12","v":0},773,0]
[{"$f":"'J1-2B'!R13","v":0},773,0]
[{"$f":"'J1-2B'!R14","v":0},773,0]
[{"$f":"'J1-2B'!R15","v":0},773,0]
[{"$f":"'J1-2B'!R16","v":0},773,0]
[{"$f":"'J1-2B'!R17","v":0},773,0]
[{"$f":"'J1-2B'!R18","v":0},773,0]
[{"$f":"'J1-2B'!R19","v":0},773,0]
[{"$f":"'J1-2B'!R20","v":0},773,0]
[{"$f":"'J1-2B'!R21","v":0},773,0]
[{"$f":"'J1-2B'!R22","v":0},773,0]
[{"$f":"'J1-2B'!R23","v":0},773,0]
[{"$f":"'J1-2B'!R24","v":0},773,0]
[{"$f":"'J1-2B'!R25","v":0},773,0]
[{"$f":"'J1-2B'!R26","v":0},773,0]
[{"$f":"'J1-2B'!R27","v":0},773,0]
[{"$f":"'J1-2B'!R28","v":0},773,0]
[{"$f":"'J1-2B'!R29","v":0},773,0]
[{"$f":"'J1-2B'!R30","v":0},773,0]
[{"$f":"'J1-2B'!R31","v":0},319,0]
[{"$f":"'J1-2B'!R32","v":0},319,0]
[{"$f":"'J1-2B'!R33","v":0},319,0]
[{"$f":"'J1-2B'!R34","v":0},319,0]
[{"$f":"'J1-2B'!R35","v":0},2727,0]
[{"$f":"'J1-2B'!S11","v":0},148,0]
[{"$f":"'J1-2B'!S12","v":0},148,0]
[{"$f":"'J1-2B'!S13","v":0},148,0]
[{"$f":"'J1-2B'!S14","v":0},148,0]
[{"$f":"'J1-2B'!S15","v":0},148,0]
[{"$f":"'J1-2B'!S16","v":0},148,0]
[{"$f":"'J1-2B'!S17","v":0},148,0]
[{"$f":"'J1-2B'!S18","v":0},148,0]
[{"$f":"'J1-2B'!S19","v":0},148,0]
[{"$f":"'J1-2B'!S20","v":0},148,0]
[{"$f":"'J1-2B'!S21","v":0},148,0]
[{"$f":"'J1-2B'!S22","v":0},148,0]
[{"$f":"'J1-2B'!S23","v":0},148,0]
[{"$f":"'J1-2B'!S24","v":0},148,0]
[{"$f":"'J1-2B'!S25","v":0},148,0]
[{"$f":"'J1-2B'!S26","v":0},148,0]
[{"$f":"'J1-2B'!S27","v":0},148,0]
[{"$f":"'J1-2B'!S28","v":0},148,0]
[{"$f":"'J1-2B'!S29","v":0},148,0]
[{"$f":"'J1-2B'!S30","v":0},148,0]
[{"$f":"'J1-2B'!S31","v":0},319,0]
[{"$f":"'J1-2B'!S32","v":0},319,0]
[{"$f":"'J1-2B'!S33","v":0},319,0]
[{"$f":"'J1-2B'!S34","v":0},319,0]
[{"$f":"'J1-2B'!S35","v":0},2727,0]
[{"$f":"'J1-2B'!S42","v":0},377,0]
[{"$f":"'J1-2B'!S43","v":0},377,0]
[{"$f":"'J1-2B'!S44","v":0},377,0]
[{"$f":"'J1-2B'!S45","v":0},377,0]
[{"$f":"'J1-2B'!S46","v":0},377,0]
[{"$f":"'J1-2B'!S47","v":0},1719,0]
[{"$f":"'J1-2B'!S48","v":0},1719,0]
[{"$f":"'J1-2B'!S49","v":0},1861,0]
[{"$f":"'J1-2B'!S50","v":0},1861,0]
[{"$f":"'J1-2B'!T11","v":0},148,0]
[{"$f":"'J1-2B'!T12","v":0},148,0]
[{"$f":"'J1-2B'!T13","v":0},148,{"$f":"A1732*B1732","v":0}]
[{"$f":"'J1-2B'!T14","v":0},148,0]
[{"$f":"'J1-2B'!T15","v":0},148,0]
[{"$f":"'J1-2B'!T16","v":0},148,0]
[{"$f":"'J1-2B'!T17","v":0},148,0]
[{"$f":"'J1-2B'!T18","v":0},148,0]
[{"$f":"'J1-2B'!T19","v":0},148,0]
[{"$f":"'J1-2B'!T20","v":0},148,0]
[{"$f":"'J1-2B'!T21","v":0},148,0]
[{"$f":"'J1-2B'!T22","v":0},148,0]
[{"$f":"'J1-2B'!T23","v":0},148,0]
[{"$f":"'J1-2B'!T24","v":0},148,0]
[{"$f":"'J1-2B'!T25","v":0},148,0]
[{"$f":"'J1-2B'!T26","v":0},148,0]
[{"$f":"'J1-2B'!T27","v":0},148,0]
[{"$f":"'J1-2B'!T28","v":0},148,0]
[{"$f":"'J1-2B'!T29","v":0},148,0]
[{"$f":"'J1-2B'!T30","v":0},148,0]
[{"$f":"'J1-2B'!T31","v":0},319,0]
[{"$f":"'J1-2B'!T32","v":0},319,0]
[{"$f":"'J1-2B'!T33","v":0},319,0]
[{"$f":"'J1-2B'!T34","v":0},319,0]
[{"$f":"'J1-2B'!T35","v":0},2727,0]
[{"$f":"'J1-2K'!E10","v":0},0,0]
[{"$f":"'J1-2K'!E11","v":0},0,0]
[{"$f":"'J1-2K'!E12","v":0},0,0]
[{"$f":"'J1-2K'!E13","v":0},0,0]
[{"$f":"'J1-2K'!E14","v":0},0,0]
[{"$f":"'J1-2K'!E15","v":0},0,0]
[{"$f":"'J1-2K'!E16","v":0},0,0]
[{"$f":"'J1-2K'!E17","v":0},0,0]
[{"$f":"'J1-2K'!E18","v":0},0,0]
[{"$f":"'J1-2K'!E19","v":0},0,0]
[{"$f":"'J1-2K'!E20","v":0},0,0]
[{"$f":"'J1-2K'!E21","v":0},0,0]
[{"$f":"'J1-2K'!F10","v":0},0,0]
[{"$f":"'J1-2K'!F11","v":0},0,0]
[{"$f":"'J1-2K'!F12","v":0},0,0]
[{"$f":"'J1-2K'!F13","v":0},0,0]
[{"$f":"'J1-2K'!F14","v":0},0,0]
[{"$f":"'J1-2K'!F15","v":0},0,0]
[{"$f":"'J1-2K'!F16","v":0},0,0]
[{"$f":"'J1-2K'!F17","v":0},0,0]
[{"$f":"'J1-2K'!F18","v":0},0,0]
[{"$f":"'J1-2K'!F19","v":0},0,0]
[{"$f":"'J1-2K'!F20","v":0},0,0]
[{"$f":"'J1-2K'!F21","v":0},0,0]
[{"$f":"'J1-2K'!G10","v":0},0,0]
[{"$f":"'J1-2K'!G11","v":0},0,0]
[{"$f":"'J1-2K'!G12","v":0},0,0]
[{"$f":"'J1-2K'!G13","v":0},0,0]
[{"$f":"'J1-2K'!G14","v":0},0,0]
[{"$f":"'J1-2K'!G15","v":0},0,0]
[{"$f":"'J1-2K'!G16","v":0},0,0]
[{"$f":"'J1-2K'!G17","v":0},0,0]
[{"$f":"'J1-2K'!G18","v":0},0,0]
[{"$f":"'J1-2K'!G19","v":0},0,0]
[{"$f":"'J1-2K'!G20","v":0},0,0]
[{"$f":"'J1-2K'!G21","v":0},0,0]
[{"$f":"'J1-2K'!H10","v":0},0,0]
[{"$f":"'J1-2K'!H11","v":0},0,0]
[{"$f":"'J1-2K'!H12","v":0},0,0]
[{"$f":"'J1-2K'!H13","v":0},0,0]
[{"$f":"'J1-2K'!H14","v":0},0,0]
[{"$f":"'J1-2K'!H15","v":0},0,{"$f":"A1796*B1796","v":0}]
[{"$f":"'J1-2K'!H16","v":0},0,0]
[{"$f":"'J1-2K'!H17","v":0},0,0]
[{"$f":"'J1-2K'!H18","v":0},0,0]
[{"$f":"'J1-2K'!H19","v":0},0,0]
[{"$f":"'J1-2K'!H20","v":0},0,0]
[{"$f":"'J1-2K'!H21","v":0},0,0]
[{"$f":"'J1-2K'!I10","v":0},0,0]
[{"$f":"'J1-2K'!I11","v":0},0,0]
[{"$f":"'J1-2K'!I12","v":0},0,0]
[{"$f":"'J1-2K'!I13","v":0},0,0]
[{"$f":"'J1-2K'!I14","v":0},0,0]
[{"$f":"'J1-2K'!I15","v":0},0,0]
[{"$f":"'J1-2K'!I16","v":0},0,0]
[{"$f":"'J1-2K'!I17","v":0},0,0]
[{"$f":"'J1-2K'!I18","v":0},0,0]
[{"$f":"'J1-2K'!I19","v":0},0,0]
[{"$f":"'J1-2K'!I20","v":0},0,0]
[{"$f":"'J1-2K'!I21","v":0},0,0]
[{"$f":"'J1-2K'!J10","v":0},0,0]
[{"$f":"'J1-2K'!J11","v":0},0,0]
[{"$f":"'J1-2K'!J12","v":0},0,0]
[{"$f":"'J1-2K'!J13","v":0},0,0]
[{"$f":"'J1-2K'!J14","v":0},0,0]
[{"$f":"'J1-2K'!J15","v":0},0,0]
[{"$f":"'J1-2K'!J16","v":0},0,0]
[{"$f":"'J1-2K'!J17","v":0},0,0]
[{"$f":"'J1-2K'!J18","v":0},0,0]
[{"$f":"'J1-2K'!J19","v":0},0,0]
[{"$f":"'J1-2K'!J20","v":0},0,0]
[{"$f":"'J1-2K'!J21","v":0},0,0]
[{"$f":"'J1-3'!E11","v":0},773,0]
[{"$f":"'J1-3'!E12","v":0},773,0]
[{"$f":"'J1-3'!E13","v":0},773,0]
[{"$f":"'J1-3'!E14","v":0},773,0]
[{"$f":"'J1-3'!E15","v":0},773,0]
[{"$f":"'J1-3'!E16","v":0},773,0]
[{"$f":"'J1-3'!E17","v":0},773,0]
[{"$f":"'J1-3'!E18","v":0},773,0]
[{"$f":"'J1-3'!E19","v":0},773,0]
[{"$f":"'J1-3'!E20","v":0},773,0]
[{"$f":"'J1-3'!E21","v":0},773,0]
[{"$f":"'J1-3'!E22","v":0},773,0]
[{"$f":"'J1-3'!E23","v":0},773,0]
[{"$f":"'J1-3'!E24","v":0},773,0]
[{"$f":"'J1-3'!E25","v":0},773,0]
[{"$f":"'J1-3'!E26","v":0},773,0]
[{"$f":"'J1-3'!E27","v":0},773,0]
[{"$f":"'J1-3'!E28","v":0},773,0]
[{"$f":"'J1-3'!E29","v":0},773,0]
[{"$f":"'J1-3'!E30","v":0},773,0]
[{"$f":"'J1-3'!E31","v":0},319,0]
[{"$f":"'J1-3'!E32","v":0},319,0]
[{"$f":"'J1-3'!E33","v":0},319,0]
[{"$f":"'J1-3'!E34","v":0},319,0]
[{"$f":"'J1-3'!E35","v":0},2727,0]
[{"$f":"'J1-3'!E42","v":0},1968,0]
[{"$f":"'J1-3'!E43","v":0},1968,0]
[{"$f":"'J1-3'!E44","v":0},1968,0]
[{"$f":"'J1-3'!E45","v":0},377,0]
[{"$f":"'J1-3'!E46","v":0},377,0]
[{"$f":"'J1-3'!E47","v":0},377,0]
[{"$f":"'J1-3'!E48","v":0},377,0]
[{"$f":"'J1-3'!E49","v":0},377,0]
[{"$f":"'J1-3'!E50","v":0},1719,{"$f":"A1860*B1860","v":0}]
[{"$f":"'J1-3'!E51","v":0},1719,0]
[{"$f":"'J1-3'!E52","v":0},1861,0]
[{"$f":"'J1-3'!E53","v":0},1861,0]
[{"$f":"'J1-3'!F11","v":0},773,0]
[{"$f":"'J1-3'!F12","v":0},773,0]
[{"$f":"'J1-3'!F13","v":0},773,0]
[{"$f":"'J1-3'!F14","v":0},773,0]
[{"$f":"'J1-3'!F15","v":0},773,0]
[{"$f":"'J1-3'!F16","v":0},773,0]
[{"$f":"'J1-3'!F17","v":0},773,0]
[{"$f":"'J1-3'!F18","v":0},773,0]
[{"$f":"'J1-3'!F19","v":0},773,0]
[{"$f":"'J1-3'!F20","v":0},773,0]
[{"$f":"'J1-3'!F21","v":0},773,0]
[{"$f":"'J1-3'!F22","v":0},773,0]
[{"$f":"'J1-3'!F23","v":0},773,0]
[{"$f":"'J1-3'!F24","v":0},773,0]
[{"$f":"'J1-3'!F25","v":0},773,0]
[{"$f":"'J1-3'!F26","v":0},773,0]
[{"$f":"'J1-3'!F27","v":0},773,0]
[{"$f":"'J1-3'!F28","v":0},773,0]
[{"$f":"'J1-3'!F29","v":0},773,0]
[{"$f":"'J1-3'!F30","v":0},773,0]
[{"$f":"'J1-3'!F31","v":0},319,0]
[{"$f":"'J1-3'!F32","v":0},319,0]
[{"$f":"'J1-3'!F33","v":0},319,0]
[{"$f":"'J1-3'!F34","v":0},319,0]
[{"$f":"'J1-3'!F35","v":0},2727,0]
[{"$f":"'J1-3'!G11","v":0},148,0]
[{"$f":"'J1-3'!G12","v":0},148,0]
[{"$f":"'J1-3'!G13","v":0},148,0]
[{"$f":"'J1-3'!G14","v":0},148,0]
[{"$f":"'J1-3'!G15","v":0},148,0]
[{"$f":"'J1-3'!G16","v":0},148,0]
[{"$f":"'J1-3'!G17","v":0},148,0]
[{"$f":"'J1-3'!G18","v":0},148,0]
[{"$f":"'J1-3'!G19","v":0},148,0]
[{"$f":"'J1-3'!G20","v":0},148,0]
[{"$f":"'J1-3'!G21","v":0},148,0]
[{"$f":"'J1-3'!G22","v":0},148,0]
[{"$f":"'J1-3'!G23","v":0},148,0]
[{"$f":"'J1-3'!G24","v":0},148,0]
[{"$f":"'J1-3'!G25","v":0},148,0]
[{"$f":"'J1-3'!G26","v":0},148,0]
[{"$f":"'J1-3'!G27","v":0},148,0]
[{"$f":"'J1-3'!G28","v":0},148,0]
[{"$f":"'J1-3'!G29","v":0},148,0]
[{"$f":"'J1-3'!G30","v":0},148,0]
[{"$f":"'J1-3'!G31","v":0},319,0]
[{"$f":"'J1-3'!G32","v":0},319,0]
[{"$f":"'J1-3'!G33","v":0},319,0]
[{"$f":"'J1-3'!G34","v":0},319,0]
[{"$f":"'J1-3'!G35","v":0},2727,0]
[{"$f":"'J1-3'!G42","v":0},1968,0]
[{"$f":"'J1-3'!G43","v":0},1968,0]
[{"$f":"'J1-3'!G44","v":0},1968,0]
[{"$f":"'J1-3'!G45","v":0},377,0]
[{"$f":"'J1-3'!G46","v":0},377,0]
[{"$f":"'J1-3'!G47","v":0},377,0]
[{"$f":"'J1-3'!G48","v":0},377,0]
[{"$f":"'J1-3'!G49","v":0},377,0]
[{"$f":"'J1-3'!G50","v":0},1719,0]
[{"$f":"'J1-3'!G51","v":0},1719,0]
[{"$f":"'J1-3'!G52","v":0},1861,{"$f":"A1924*B1924","v":0}]
[{"$f":"'J1-3'!G53","v":0},1861,0]
[{"$f":"'J1-3'!H11","v":0},148,0]
[{"$f":"'J1-3'!H12","v":0},148,0]
[{"$f":"'J1-3'!H13","v":0},148,0]
[{"$f":"'J1-3'!H14","v":0},148,0]
[{"$f":"'J1-3'!H15","v":0},148,0]
[{"$f":"'J1-3'!H16","v":0},148,0]
[{"$f":"'J1-3'!H17","v":0},148,0]
[{"$f":"'J1-3'!H18","v":0},148,0]
[{"$f":"'J1-3'!H19","v":0},148,0]
[{"$f":"'J1-3'!H20","v":0},148,0]
[{"$f":"'J1-3'!H21","v":0},148,0]
[{"$f":"'J1-3'!H22","v":0},148,0]
[{"$f":"'J1-3'!H23","v":0},148,0]
[{"$f":"'J1-3'!H24","v":0},148,0]
[{"$f":"'J1-3'!H25","v":0},148,0]
[{"$f":"'J1-3'!H26","v":0},148,0]
[{"$f":"'J1-3'!H27","v":0},148,0]
[{"$f":"'J1-3'!H28","v":0},148,0]
[{"$f":"'J1-3'!H29","v":0},148,0]
[{"$f":"'J1-3'!H30","v":0},148,0]
[{"$f":"'J1-3'!H31","v":0},319,0]
[{"$f":"'J1-3'!H32","v":0},319,0]
[{"$f":"'J1-3'!H33","v":0},319,0]
[{"$f":"'J1-3'!H34","v":0},319,0]
[{"$f":"'J1-3'!H35","v":0},2727,0]
[{"$f":"'J1-3'!I11","v":0},773,0]
[{"$f":"'J1-3'!I12","v":0},773,0]
[{"$f":"'J1-3'!I13","v":0},773,0]
[{"$f":"'J1-3'!I14","v":0},773,0]
[{"$f":"'J1-3'!I15","v":0},773,0]
[{"$f":"'J1-3'!I16","v":0},773,0]
[{"$f":"'J1-3'!I17","v":0},773,0]
[{"$f":"'J1-3'!I18","v":0},773,0]
[{"$f":"'J1-3'!I19","v":0},773,0]
[{"$f":"'J1-3'!I20","v":0},773,0]
[{"$f":"'J1-3'!I21","v":0},773,0]
[{"$f":"'J1-3'!I22","v":0},773,0]
[{"$f":"'J1-3'!I23","v":0},773,0]
[{"$f":"'J1-3'!I24","v":0},773,0]
[{"$f":"'J1-3'!I25","v":0},773,0]
[{"$f":"'J1-3'!I26","v":0},773,0]
[{"$f":"'J1-3'!I27","v":0},773,0]
[{"$f":"'J1-3'!I28","v":0},773,0]
[{"$f":"'J1-3'!I29","v":0},773,0]
[{"$f":"'J1-3'!I30","v":0},773,0]
[{"$f":"'J1-3'!I31","v":0},319,0]
[{"$f":"'J1-3'!I32","v":0},319,0]
[{"$f":"'J1-3'!I33","v":0},319,0]
[{"$f":"'J1-3'!I34","v":0},319,0]
[{"$f":"'J1-3'!I35","v":0},2727,0]
[{"$f":"'J1-3'!I42","v":0},1968,0]
[{"$f":"'J1-3'!I43","v":0},1968,0]
[{"$f":"'J1-3'!I44","v":0},1968,0]
[{"$f":"'J1-3'!I45","v":0},377,0]
[{"$f":"'J1-3'!I46","v":0},377,0]
[{"$f":"'J1-3'!I47","v":0},377,0]
[{"$f":"'J1-3'!I48","v":0},377,0]
[{"$f":"'J1-3'!I49","v":0},377,0]
[{"$f":"'J1-3'!I50","v":0},1719,0]
[{"$f":"'J1-3'!I51","v":0},1719,0]
[{"$f":"'J1-3'!I52","v":0},1861,0]
[{"$f":"'J1-3'!I53","v":0},1861,0]
[{"$f":"'J1-3'!J11","v":0},773,{"$f":"A1988*B1988","v":0}]
[{"$f":"'J1-3'!J12","v":0},773,0]
[{"$f":"'J1-3'!J13","v":0},773,0]
[{"$f":"'J1-3'!J14","v":0},773,0]
[{"$f":"'J1-3'!J15","v":0},773,0]
[{"$f":"'J1-3'!J16","v":0},773,0]
[{"$f":"'J1-3'!J17","v":0},773,0]
[{"$f":"'J1-3'!J18","v":0},773,0]
[{"$f":"'J1-3'!J19","v":0},773,0]
[{"$f":"'J1-3'!J20","v":0},773,0]
[{"$f":"'J1-3'!J21","v":0},773,0]
[{"$f":"'J1-3'!J22","v":0},773,0]
[{"$f":"'J1-3'!J23","v":0},773,0]
[{"$f":"'J1-3'!J24","v":0},773,0]
[{"$f":"'J1-3'!J25","v":0},773,0]
[{"$f":"'J1-3'!J26","v":0},773,0]
[{"$f":"'J1-3'!J27","v":0},773,0]
[{"$f":"'J1-3'!J28","v":0},773,0]
[{"$f":"'J1-3'!J29","v":0},773,0]
[{"$f":"'J1-3'!J30","v":0},773,0]
[{"$f":"'J1-3'!J31","v":0},319,0]
[{"$f":"'J1-3'!J32","v":0},319,0]
[{"$f":"'J1-3'!J33","v":0},319,0]
[{"$f":"'J1-3'!J34","v":0},319,0]
[{"$f":"'J1-3'!J35","v":0},2727,0]
[{"$f":"'J1-3'!K11","v":0},148,0]
[{"$f":"'J1-3'!K12","v":0},148,0]
[{"$f":"'J1-3'!K13","v":0},148,0]
[{"$f":"'J1-3'!K14","v":0},148,0]
[{"$f":"'J1-3'!K15","v":0},148,0]
[{"$f":"'J1-3'!K16","v":0},148,0]
[{"$f":"'J1-3'!K17","v":0},148,0]
[{"$f":"'J1-3'!K18","v":0},148,0]
[{"$f":"'J1-3'!K19","v":0},148,0]
[{"$f":"'J1-3'!K20","v":0},148,0]
[{"$f":"'J1-3'!K21","v":0},148,0]
[{"$f":"'J1-3'!K22","v":0},148,0]
[{"$f":"'J1-3'!K23","v":0},148,0]
[{"$f":"'J1-3'!K24","v":0},148,0]
[{"$f":"'J1-3'!K25","v":0},148,0]
[{"$f":"'J1-3'!K26","v":0},148,0]
[{"$f":"'J1-3'!K27","v":0},148,0]
[{"$f":"'J1-3'!K28","v":0},148,0]
[{"$f":"'J1-3'!K29","v":0},148,0]
[{"$f":"'J1-3'!K30","v":0},148,0]
[{"$f":"'J1-3'!K31","v":0},319,0]
[{"$f":"'J1-3'!K32","v":0},319,0]
[{"$f":"'J1-3'!K33","v":0},319,0]
[{"$f":"'J1-3'!K34","v":0},319,0]
[{"$f":"'J1-3'!K35","v":0},2727,0]
[{"$f":"'J1-3'!K42","v":0},1968,0]
[{"$f":"'J1-3'!K43","v":0},1968,0]
[{"$f":"'J1-3'!K44","v":0},1968,0]
[{"$f":"'J1-3'!K45","v":0},377,0]
[{"$f":"'J1-3'!K46","v":0},377,0]
[{"$f":"'J1-3'!K47","v":0},377,0]
[{"$f":"'J1-3'!K48","v":0},377,0]
[{"$f":"'J1-3'!K49","v":0},377,0]
[{"$f":"'J1-3'!K50","v":0},1719,0]
[{"$f":"'J1-3'!K51","v":0},1719,0]
[{"$f":"'J1-3'!K52","v":0},1861,0]
[{"$f":"'J1-3'!K53","v":0},1861,0]
[{"$f":"'J1-3'!L11","v":0},148,0]
[{"$f":"'J1-3'!L12","v":0},148,0]
[{"$f":"'J1-3'!L13","v":0},148,{"$f":"A2052*B2052","v":0}]
[{"$f":"'J1-3'!L14","v":0},148,0]
[{"$f":"'J1-3'!L15","v":0},148,0]
[{"$f":"'J1-3'!L16","v":0},148,0]
[{"$f":"'J1-3'!L17","v":0},148,0]
[{"$f":"'J1-3'!L18","v":0},148,0]
[{"$f":"'J1-3'!L19","v":0},148,0]
[{"$f":"'J1-3'!L20","v":0},148,0]
[{"$f":"'J1-3'!L21","v":0},148,0]
[{"$f":"'J1-3'!L22","v":0},148,0]
[{"$f":"'J1-3'!L23","v":0},148,0]
[{"$f":"'J1-3'!L24","v":0},148,0]
[{"$f":"'J1-3'!L25","v":0},148,0]
[{"$f":"'J1-3'!L26","v":0},148,0]
[{"$f":"'J1-3'!L27","v":0},148,0]
[{"$f":"'J1-3'!L28","v":0},148,0]
[{"$f":"'J1-3'!L29","v":0},148,0]
[{"$f":"'J1-3'!L30","v":0},148,0]
[{"$f":"'J1-3'!L31","v":0},319,0]
[{"$f":"'J1-3'!L32","v":0},319,0]
[{"$f":"'J1-3'!L33","v":0},319,0]
[{"$f":"'J1-3'!L34","v":0},319,0]
[{"$f":"'J1-3'!L35","v":0},2727,0]
[{"$f":"'J1-3'!M11","v":0},773,0]
[{"$f":"'J1-3'!M12","v":0},773,0]
[{"$f":"'J1-3'!M13","v":0},773,0]
[{"$f":"'J1-3'!M14","v":0},773,0]
[{"$f":"'J1-3'!M15","v":0},773,0]
[{"$f":"'J1-3'!M16","v":0},773,0]
[{"$f":"'J1-3'!M17","v":0},773,0]
[{"$f":"'J1-3'!M18","v":0},773,0]
[{"$f":"'J1-3'!M19","v":0},773,0]
[{"$f":"'J1-3'!M20","v":0},773,0]
[{"$f":"'J1-3'!M21","v":0},773,0]
[{"$f":"'J1-3'!M22","v":0},773,0]
[{"$f":"'J1-3'!M23","v":0},773,0]
[{"$f":"'J1-3'!M24","v":0},773,0]
[{"$f":"'J1-3'!M25","v":0},773,0]
[{"$f":"'J1-3'!M26","v":0},773,0]
[{"$f":"'J1-3'!M27","v":0},773,0]
[{"$f":"'J1-3'!M28","v":0},773,0]
[{"$f":"'J1-3'!M29","v":0},773,0]
[{"$f":"'J1-3'!M30","v":0},773,0]
[{"$f":"'J1-3'!M31","v":0},319,0]
[{"$f":"'J1-3'!M32","v":0},319,0]
[{"$f":"'J1-3'!M33","v":0},319,0]
[{"$f":"'J1-3'!M34","v":0},319,0]
[{"$f":"'J1-3'!M35","v":0},2727,0]
[{"$f":"'J1-3'!M42","v":0},1968,0]
[{"$f":"'J1-3'!M43","v":0},1968,0]
[{"$f":"'J1-3'!M44","v":0},1968,0]
[{"$f":"'J1-3'!M45","v":0},377,0]
[{"$f":"'J1-3'!M46","v":0},377,0]
[{"$f":"'J1-3'!M47","v":0},377,0]
[{"$f":"'J1-3'!M48","v":0},377,0]
[{"$f":"'J1-3'!M49","v":0},377,0]
[{"$f":"'J1-3'!M50","v":0},1719,0]
[{"$f":"'J1-3'!M51","v":0},1719,0]
[{"$f":"'J1-3'!M52","v":0},1861,0]
[{"$f":"'J1-3'!M53","v":0},1861,0]
[{"$f":"'J1-3'!N11","v":0},773,0]
[{"$f":"'J1-3'!N12","v":0},773,0]
[{"$f":"'J1-3'!N13","v":0},773,0]
[{"$f":"'J1-3'!N14","v":0},773,0]
[{"$f":"'J1-3'!N15","v":0},773,{"$f":"A2116*B2116","v":0}]
[{"$f":"'J1-3'!N16","v":0},773,0]
[{"$f":"'J1-3'!N17","v":0},773,0]
[{"$f":"'J1-3'!N18","v":0},773,0]
[{"$f":"'J1-3'!N19","v":0},773,0]
[{"$f":"'J1-3'!N20","v":0},773,0]
[{"$f":"'J1-3'!N21","v":0},773,0]
[{"$f":"'J1-3'!N22","v":0},773,0]
[{"$f":"'J1-3'!N23","v":0},773,0]
[{"$f":"'J1-3'!N24","v":0},773,0]
[{"$f":"'J1-3'!N25","v":0},773,0]
[{"$f":"'J1-3'!N26","v":0},773,0]
[{"$f":"'J1-3'!N27","v":0},773,0]
[{"$f":"'J1-3'!N28","v":0},773,0]
[{"$f":"'J1-3'!N29","v":0},773,0]
[{"$f":"'J1-3'!N30","v":0},773,0]
[{"$f":"'J1-3'!N31","v":0},319,0]
[{"$f":"'J1-3'!N32","v":0},319,0]
[{"$f":"'J1-3'!N33","v":0},319,0]
[{"$f":"'J1-3'!N34","v":0},319,0]
[{"$f":"'J1-3'!N35","v":0},2727,0]
[{"$f":"'J1-3'!O11","v":0},148,0]
[{"$f":"'J1-3'!O12","v":0},148,0]
[{"$f":"'J1-3'!O13","v":0},148,0]
[{"$f":"'J1-3'!O14","v":0},148,0]
[{"$f":"'J1-3'!O15","v":0},148,0]
[{"$f":"'J1-3'!O16","v":0},148,0]
[{"$f":"'J1-3'!O17","v":0},148,0]
[{"$f":"'J1-3'!O18","v":0},148,0]
[{"$f":"'J1-3'!O19","v":0},148,0]
[{"$f":"'J1-3'!O20","v":0},148,0]
[{"$f":"'J1-3'!O21","v":0},148,0]
[{"$f":"'J1-3'!O22","v":0},148,0]
[{"$f":"'J1-3'!O23","v":0},148,0]
[{"$f":"'J1-3'!O24","v":0},148,0]
[{"$f":"'J1-3'!O25","v":0},148,0]
[{"$f":"'J1-3'!O26","v":0},148,0]
[{"$f":"'J1-3'!O27","v":0},148,0]
[{"$f":"'J1-3'!O28","v":0},148,0]
[{"$f":"'J1-3'!O29","v":0},148,0]
[{"$f":"'J1-3'!O30","v":0},148,0]
[{"$f":"'J1-3'!O31","v":0},319,0]
[{"$f":"'J1-3'!O32","v":0},319,0]
[{"$f":"'J1-3'!O33","v":0},319,0]
[{"$f":"'J1-3'!O34","v":0},319,0]
[{"$f":"'J1-3'!O35","v":0},2727,0]
[{"$f":"'J1-3'!O42","v":0},1968,0]
[{"$f":"'J1-3'!O43","v":0},1968,0]
[{"$f":"'J1-3'!O44","v":0},1968,0]
[{"$f":"'J1-3'!O45","v":0},377,0]
[{"$f":"'J1-3'!O46","v":0},377,0]
[{"$f":"'J1-3'!O47","v":0},377,0]
[{"$f":"'J1-3'!O48","v":0},377,0]
[{"$f":"'J1-3'!O49","v":0},377,0]
[{"$f":"'J1-3'!O50","v":0},1719,0]
[{"$f":"'J1-3'!O51","v":0},1719,0]
[{"$f":"'J1-3'!O52","v":0},1861,0]
[{"$f":"'J1-3'!O53","v":0},1861,0]
[{"$f":"'J1-3'!P11","v":0},148,0]
[{"$f":"'J1-3'!P12","v":0},148,0]
[{"$f":"'J1-3'!P13","v":0},148,0]
[{"$f":"'J1-3'!P14","v":0},148,0]
[{"$f":"'J1-3'!P15","v":0},148,0]
[{"$f":"'J1-3'!P16","v":0},148,0]
[{"$f":"'J1-3'!P17","v":0},148,{"$f":"A2180*B2180","v":0}]
[{"$f":"'J1-3'!P18","v":0},148,0]
[{"$f":"'J1-3'!P19","v":0},148,0]
[{"$f":"'J1-3'!P20","v":0},148,0]
[{"$f":"'J1-3'!P21","v":0},148,0]
[{"$f":"'J1-3'!P22","v":0},148,0]
[{"$f":"'J1-3'!P23","v":0},148,0]
[{"$f":"'J1-3'!P24","v":0},148,0]
[{"$f":"'J1-3'!P25","v":0},148,0]
[{"$f":"'J1-3'!P26","v":0},148,0]
[{"$f":"'J1-3'!P27","v":0},148,0]
[{"$f":"'J1-3'!P28","v":0},148,0]
[{"$f":"'J1-3'!P29","v":0},148,0]
[{"$f":"'J1-3'!P30","v":0},148,0]
[{"$f":"'J1-3'!P31","v":0},319,0]
[{"$f":"'J1-3'!P32","v":0},319,0]
[{"$f":"'J1-3'!P33","v":0},319,0]
[{"$f":"'J1-3'!P34","v":0},319,0]
[{"$f":"'J1-3'!P35","v":0},2727,0]
[{"$f":"'J1-3'!Q11","v":0},773,0]
[{"$f":"'J1-3'!Q12","v":0},773,0]
[{"$f":"'J1-3'!Q13","v":0},773,0]
[{"$f":"'J1-3'!Q14","v":0},773,0]
[{"$f":"'J1-3'!Q15","v":0},773,0]
[{"$f":"'J1-3'!Q16","v":0},773,0]
[{"$f":"'J1-3'!Q17","v":0},773,0]
[{"$f":"'J1-3'!Q18","v":0},773,0]
[{"$f":"'J1-3'!Q19","v":0},773,0]
[{"$f":"'J1-3'!Q20","v":0},773,0]
[{"$f":"'J1-3'!Q21","v":0},773,0]
[{"$f":"'J1-3'!Q22","v":0},773,0]
[{"$f":"'J1-3'!Q23","v":0},773,0]
[{"$f":"'J1-3'!Q24","v":0},773,0]
[{"$f":"'J1-3'!Q25","v":0},773,0]
[{"$f":"'J1-3'!Q26","v":0},773,0]
[{"$f":"'J1-3'!Q27","v":0},773,0]
[{"$f":"'J1-3'!Q28","v":0},773,0]
[{"$f":"'J1-3'!Q29","v":0},773,0]
[{"$f":"'J1-3'!Q30","v":0},773,0]
[{"$f":"'J1-3'!Q31","v":0},319,0]
[{"$f":"'J1-3'!Q32","v":0},319,0]
[{"$f":"'J1-3'!Q33","v":0},319,0]
[{"$f":"'J1-3'!Q34","v":0},319,0]
[{"$f":"'J1-3'!Q35","v":0},2727,0]
[{"$f":"'J1-3'!Q42","v":0},1968,0]
[{"$f":"'J1-3'!Q43","v":0},1968,0]
[{"$f":"'J1-3'!Q44","v":0},1968,0]
[{"$f":"'J1-3'!Q45","v":0},377,0]
[{"$f":"'J1-3'!Q46","v":0},377,0]
[{"$f":"'J1-3'!Q47","v":0},377,0]
[{"$f":"'J1-3'!Q48","v":0},377,0]
[{"$f":"'J1-3'!Q49","v":0},377,0]
[{"$f":"'J1-3'!Q50","v":0},1719,0]
[{"$f":"'J1-3'!Q51","v":0},1719,0]
[{"$f":"'J1-3'!Q52","v":0},1861,0]
[{"$f":"'J1-3'!Q53","v":0},1861,0]
[{"$f":"'J1-3'!R11","v":0},773,0]
[{"$f":"'J1-3'!R12","v":0},773,0]
[{"$f":"'J1-3'!R13","v":0},773,0]
[{"$f":"'J1-3'!R14","v":0},773,0]
[{"$f":"'J1-3'!R15","v":0},773,0]
[{"$f":"'J1-3'!R16","v":0},773,0]
[{"$f":"'J1-3'!R17","v":0},773,0]
[{"$f":"'J1-3'!R18","v":0},773,0]
[{"$f":"'J1-3'!R19","v":0},773,{"$f":"A2244*B2244","v":0}]
[{"$f":"'J1-3'!R20","v":0},773,0]
[{"$f":"'J1-3'!R21","v":0},773,0]
[{"$f":"'J1-3'!R22","v":0},773,0]
[{"$f":"'J1-3'!R23","v":0},773,0]
[{"$f":"'J1-3'!R24","v":0},773,0]
[{"$f":"'J1-3'!R25","v":0},773,0]
[{"$f":"'J1-3'!R26","v":0},773,0]
[{"$f":"'J1-3'!R27","v":0},773,0]
[{"$f":"'J1-3'!R28","v":0},773,0]
[{"$f":"'J1-3'!R29","v":0},773,0]
[{"$f":"'J1-3'!R30","v":0},773,0]
[{"$f":"'J1-3'!R31","v":0},319,0]
[{"$f":"'J1-3'!R32","v":0},319,0]
[{"$f":"'J1-3'!R33","v":0},319,0]
[{"$f":"'J1-3'!R34","v":0},319,0]
[{"$f":"'J1-3'!R35","v":0},2727,0]
[{"$f":"'J1-3'!S11","v":0},148,0]
[{"$f":"'J1-3'!S12","v":0},148,0]
[{"$f":"'J1-3'!S13","v":0},148,0]
[{"$f":"'J1-3'!S14","v":0},148,0]
[{"$f":"'J1-3'!S15","v":0},148,0]
[{"$f":"'J1-3'!S16","v":0},148,0]
[{"$f":"'J1-3'!S17","v":0},148,0]
[{"$f":"'J1-3'!S18","v":0},148,0]
[{"$f":"'J1-3'!S19","v":0},148,0]
[{"$f":"'J1-3'!S20","v":0},148,0]
[{"$f":"'J1-3'!S21","v":0},148,0]
[{"$f":"'J1-3'!S22","v":0},148,0]
[{"$f":"'J1-3'!S23","v":0},148,0]
[{"$f":"'J1-3'!S24","v":0},148,0]
[{"$f":"'J1-3'!S25","v":0},148,0]
[{"$f":"'J1-3'!S26","v":0},148,0]
[{"$f":"'J1-3'!S27","v":0},148,0]
[{"$f":"'J1-3'!S28","v":0},148,0]
[{"$f":"'J1-3'!S29","v":0},148,0]
[{"$f":"'J1-3'!S30","v":0},148,0]
[{"$f":"'J1-3'!S31","v":0},319,0]
[{"$f":"'J1-3'!S32","v":0},319,0]
[{"$f":"'J1-3'!S33","v":0},319,0]
[{"$f":"'J1-3'!S34","v":0},319,0]
[{"$f":"'J1-3'!S35","v":0},2727,0]
[{"$f":"'J1-3'!S42","v":0},1968,0]
[{"$f":"'J1-3'!S43","v":0},1968,0]
[{"$f":"'J1-3'!S44","v":0},1968,0]
[{"$f":"'J1-3'!S45","v":0},377,0]
[{"$f":"'J1-3'!S46","v":0},377,0]
[{"$f":"'J1-3'!S47","v":0},377,0]
[{"$f":"'J1-3'!S48","v":0},377,0]
[{"$f":"'J1-3'!S49","v":0},377,0]
[{"$f":"'J1-3'!S50","v":0},1719,0]
[{"$f":"'J1-3'!S51","v":0},1719,0]
[{"$f":"'J1-3'!S52","v":0},1861,0]
[{"$f":"'J1-3'!S53","v":0},1861,0]
[{"$f":"'J1-3'!T11","v":0},148,0]
[{"$f":"'J1-3'!T12","v":0},148,0]
[{"$f":"'J1-3'!T13","v":0},148,0]
[{"$f":"'J1-3'!T14","v":0},148,0]
[{"$f":"'J1-3'!T15","v":0},148,0]
[{"$f":"'J1-3'!T16","v":0},148,0]
[{"$f":"'J1-3'!T17","v":0},148,0]
[{"$f":"'J1-3'!T18","v":0},148,0]
[{"$f":"'J1-3'!T19","v":0},148,0]
[{"$f":"'J1-3'!T20","v":0},148,0]
[{"$f":"'J1-3'!T21","v":0},148,{"$f":"A2308*B2308","v":0}]
[{"$f":"'J1-3'!T22","v":0},148,0]
[{"$f":"'J1-3'!T23","v":0},148,0]
[{"$f":"'J1-3'!T24","v":0},148,0]
[{"$f":"'J1-3'!T25","v":0},148,0]
[{"$f":"'J1-3'!T26","v":0},148,0]
[{"$f":"'J1-3'!T27","v":0},148,0]
[{"$f":"'J1-3'!T28","v":0},148,0]
[{"$f":"'J1-3'!T29","v":0},148,0]
[{"$f":"'J1-3'!T30","v":0},148,0]
[{"$f":"'J1-3'!T31","v":0},319,0]
[{"$f":"'J1-3'!T32","v":0},319,0]
[{"$f":"'J1-3'!T33","v":0},319,0]
[{"$f":"'J1-3'!T34","v":0},319,0]
[{"$f":"'J1-3'!T35","v":0},2727,0]
[{"$f":"'J1-3K'!E11","v":0},0,0]
[{"$f":"'J1-3K'!E12","v":0},0,0]
[{"$f":"'J1-3K'!E13","v":0},0,0]
[{"$f":"'J1-3K'!E14","v":0},0,0]
[{"$f":"'J1-3K'!E15","v":0},0,0]
[{"$f":"'J1-3K'!E16","v":0},0,0]
[{"$f":"'J1-3K'!E17","v":0},0,0]
[{"$f":"'J1-3K'!E18","v":0},0,0]
[{"$f":"'J1-3K'!E19","v":0},0,0]
[{"$f":"'J1-3K'!E20","v":0},0,0]
[{"$f":"'J1-3K'!E21","v":0},0,0]
[{"$f":"'J1-3K'!E22","v":0},0,0]
[{"$f":"'J1-3K'!F11","v":0},0,0]
[{"$f":"'J1-3K'!F12","v":0},0,0]
[{"$f":"'J1-3K'!F13","v":0},0,0]
[{"$f":"'J1-3K'!F14","v":0},0,0]
[{"$f":"'J1-3K'!F15","v":0},0,0]
[{"$f":"'J1-3K'!F16","v":0},0,0]
[{"$f":"'J1-3K'!F17","v":0},0,0]
[{"$f":"'J1-3K'!F18","v":0},0,0]
[{"$f":"'J1-3K'!F19","v":0},0,0]
[{"$f":"'J1-3K'!F20","v":0},0,0]
[{"$f":"'J1-3K'!F21","v":0},0,0]
[{"$f":"'J1-3K'!F22","v":0},0,0]
[{"$f":"'J1-3K'!G11","v":0},0,0]
[{"$f":"'J1-3K'!G12","v":0},0,0]
[{"$f":"'J1-3K'!G13","v":0},0,0]
[{"$f":"'J1-3K'!G14","v":0},0,0]
[{"$f":"'J1-3K'!G15","v":0},0,0]
[{"$f":"'J1-3K'!G16","v":0},0,0]
[{"$f":"'J1-3K'!G17","v":0},0,0]
[{"$f":"'J1-3K'!G18","v":0},0,0]
[{"$f":"'J1-3K'!G19","v":0},0,0]
[{"$f":"'J1-3K'!G20","v":0},0,0]
[{"$f":"'J1-3K'!G21","v":0},0,0]
[{"$f":"'J1-3K'!G22","v":0},0,0]
[{"$f":"'J1-3K'!H11","v":0},0,0]
[{"$f":"'J1-3K'!H12","v":0},0,0]
[{"$f":"'J1-3K'!H13","v":0},0,0]
[{"$f":"'J1-3K'!H14","v":0},0,0]
[{"$f":"'J1-3K'!H15","v":0},0,0]
[{"$f":"'J1-3K'!H16","v":0},0,0]
[{"$f":"'J1-3K'!H17","v":0},0,0]
[{"$f":"'J1-3K'!H18","v":0},0,0]
[{"$f":"'J1-3K'!H19","v":0},0,0]
[{"$f":"'J1-3K'!H20","v":0},0,0]
[{"$f":"'J1-3K'!H21","v":0},0,0]
[{"$f":"'J1-3K'!H22","v":0},0,0]
[{"$f":"'J2'!E10","v":0},0,0]
[{"$f":"'J2'!E11","v":0},0,{"$f":"A2372*B2372","v":0}]
[{"$f":"'J2'!E12","v":0},0,0]
[{"$f":"'J2'!E13","v":0},0,0]
[{"$f":"'J2'!E14","v":0},0,0]
[{"$f":"'J2'!E15","v":0},0,0]
[{"$f":"'J2'!E16","v":0},0,0]
[{"$f":"'J2'!E17","v":0},0,0]
[{"$f":"'J2'!E18","v":0},0,0]
[{"$f":"'J2'!E19","v":0},0,0]
[{"$f":"'J2'!E20","v":0},0,0]
[{"$f":"'J2'!E21","v":0},0,0]
[{"$f":"'J2'!E9","v":0},0,0]
[{"$f":"'J2'!F10","v":0},0,0]
[{"$f":"'J2'!F11","v":0},0,0]
[{"$f":"'J2'!F12","v":0},0,0]
[{"$f":"'J2'!F13","v":0},0,0]
[{"$f":"'J2'!F14","v":0},0,0]
[{"$f":"'J2'!F15","v":0},0,0]
[{"$f":"'J2'!F16","v":0},0,0]
[{"$f":"'J2'!F17","v":0},0,0]
[{"$f":"'J2'!F18","v":0},0,0]
[{"$f":"'J2'!F19","v":0},0,0]
[{"$f":"'J2'!F20","v":0},0,0]
[{"$f":"'J2'!F21","v":0},0,0]
[{"$f":"'J2'!F9","v":0},0,0]
[{"$f":"'J2'!G10","v":0},0,0]
[{"$f":"'J2'!G11","v":0},0,0]
[{"$f":"'J2'!G12","v":0},0,0]
[{"$f":"'J2'!G13","v":0},0,0]
[{"$f":"'J2'!G14","v":0},0,0]
[{"$f":"'J2'!G15","v":0},0,0]
[{"$f":"'J2'!G16","v":0},0,0]
[{"$f":"'J2'!G18","v":0},0,0]
[{"$f":"'J2'!G19","v":0},0,0]
[{"$f":"'J2'!G20","v":0},0,0]
[{"$f":"'J2'!G21","v":0},0,0]
[{"$f":"'J2'!G9","v":0},0,0]
[{"$f":"'J2'!H10","v":0},0,0]
[{"$f":"'J2'!H11","v":0},0,0]
[{"$f":"'J2'!H12","v":0},0,0]
[{"$f":"'J2'!H13","v":0},0,0]
[{"$f":"'J2'!H14","v":0},0,0]
[{"$f":"'J2'!H15","v":0},0,0]
[{"$f":"'J2'!H16","v":0},0,0]
[{"$f":"'J2'!H18","v":0},0,0]
[{"$f":"'J2'!H19","v":0},0,0]
[{"$f":"'J2'!H20","v":0},0,0]
[{"$f":"'J2'!H21","v":0},0,0]
[{"$f":"'J2'!H9","v":0},0,0]
[{"$f":"'J2'!I10","v":0},0,0]
[{"$f":"'J2'!I11","v":0},0,0]
[{"$f":"'J2'!I12","v":0},0,0]
[{"$f":"'J2'!I13","v":0},0,0]
[{"$f":"'J2'!I14","v":0},0,0]
[{"$f":"'J2'!I15","v":0},0,0]
[{"$f":"'J2'!I16","v":0},0,0]
[{"$f":"'J2'!I18","v":0},0,0]
[{"$f":"'J2'!I19","v":0},0,0]
[{"$f":"'J2'!I20","v":0},0,0]
[{"$f":"'J2'!I21","v":0},0,0]
[{"$f":"'J2'!I9","v":0},0,0]
[{"$f":"'J2'!J10","v":0},0,0]
[{"$f":"'J2'!J11","v":0},0,0]
[{"$f":"'J2'!J12","v":0},0,0]
[{"$f":"'J2'!J13","v":0},0,{"$f":"A2436*B2436","v":0}]
[{"$f":"'J2'!J14","v":0},0,0]
[{"$f":"'J2'!J15","v":0},0,0]
[{"$f":"'J2'!J16","v":0},0,0]
[{"$f":"'J2'!J18","v":0},0,0]
[{"$f":"'J2'!J19","v":0},0,0]
[{"$f":"'J2'!J20","v":0},0,0]
[{"$f":"'J2'!J21","v":0},0,0]
[{"$f":"'J2'!J9","v":0},0,0]
[{"$f":"'J2'!K10","v":0},0,0]
[{"$f":"'J2'!K11","v":0},0,0]
[{"$f":"'J2'!K12","v":0},0,0]
[{"$f":"'J2'!K13","v":0},0,0]
[{"$f":"'J2'!K14","v":0},0,0]
[{"$f":"'J2'!K15","v":0},0,0]
[{"$f":"'J2'!K16","v":0},0,0]
[{"$f":"'J2'!K17","v":0},0,0]
[{"$f":"'J2'!K18","v":0},0,0]
[{"$f":"'J2'!K19","v":0},0,0]
[{"$f":"'J2'!K20","v":0},0,0]
[{"$f":"'J2'!K21","v":0},0,0]
[{"$f":"'J2'!K9","v":0},0,0]
[{"$f":"'J2'!L10","v":0},0,0]
[{"$f":"'J2'!L11","v":0},0,0]
[{"$f":"'J2'!L12","v":0},0,0]
[{"$f":"'J2'!L13","v":0},0,0]
[{"$f":"'J2'!L14","v":0},0,0]
[{"$f":"'J2'!L15","v":0},0,0]
[{"$f":"'J2'!L16","v":0},0,0]
[{"$f":"'J2'!L17","v":0},0,0]
[{"$f":"'J2'!L18","v":0},0,0]
[{"$f":"'J2'!L19","v":0},0,0]
[{"$f":"'J2'!L20","v":0},0,0]
[{"$f":"'J2'!L21","v":0},0,0]
[{"$f":"'J2'!L9","v":0},0,0]
[{"$f":"'J3'!E10","v":0},0,0]
[{"$f":"'J3'!E11","v":0},0,0]
[{"$f":"'J3'!E12","v":0},0,0]
[{"$f":"'J3'!E13","v":0},0,0]
[{"$f":"'J3'!E14","v":0},0,0]
[{"$f":"'J3'!E15","v":0},0,0]
[{"$f":"'J3'!E16","v":0},0,0]
[{"$f":"'J3'!E17","v":0},0,0]
[{"$f":"'J3'!E18","v":0},0,0]
[{"$f":"'J3'!E19","v":0},0,0]
[{"$f":"'J3'!E20","v":0},0,0]
[{"$f":"'J3'!E21","v":0},0,0]
[{"$f":"'J3'!E9","v":0},0,0]
[{"$f":"'J3'!F10","v":0},0,0]
[{"$f":"'J3'!F11","v":0},0,0]
[{"$f":"'J3'!F12","v":0},0,0]
[{"$f":"'J3'!F13","v":0},0,0]
[{"$f":"'J3'!F14","v":0},0,0]
[{"$f":"'J3'!F15","v":0},0,0]
[{"$f":"'J3'!F16","v":0},0,0]
[{"$f":"'J3'!F17","v":0},0,0]
[{"$f":"'J3'!F18","v":0},0,0]
[{"$f":"'J3'!F19","v":0},0,0]
[{"$f":"'J3'!F20","v":0},0,0]
[{"$f":"'J3'!F21","v":0},0,0]
[{"$f":"'J3'!F9","v":0},0,0]
[{"$f":"'J3'!G10","v":0},0,0]
[{"$f":"'J3'!G11","v":0},0,0]
[{"$f":"'J3'!G12","v":0},0,0]
[{"$f":"'J3'!G13","v":0},0,{"$f":"A2500*B2500","v":0}]
[{"$f":"'J3'!G14","v":0},0,0]
[{"$f":"'J3'!G15","v":0},0,0]
[{"$f":"'J3'!G16","v":0},0,0]
[{"$f":"'J3'!G18","v":0},0,0]
[{"$f":"'J3'!G19","v":0},0,0]
[{"$f":"'J3'!G20","v":0},0,0]
[{"$f":"'J3'!G21","v":0},0,0]
[{"$f":"'J3'!G9","v":0},0,0]
[{"$f":"'J3'!H10","v":0},0,0]
[{"$f":"'J3'!H11","v":0},0,0]
[{"$f":"'J3'!H12","v":0},0,0]
[{"$f":"'J3'!H13","v":0},0,0]
[{"$f":"'J3'!H14","v":0},0,0]
[{"$f":"'J3'!H15","v":0},0,0]
[{"$f":"'J3'!H16","v":0},0,0]
[{"$f":"'J3'!H18","v":0},0,0]
[{"$f":"'J3'!H19","v":0},0,0]
[{"$f":"'J3'!H20","v":0},0,0]
[{"$f":"'J3'!H21","v":0},0,0]
[{"$f":"'J3'!H9","v":0},0,0]
[{"$f":"'J3'!I10","v":0},0,0]
[{"$f":"'J3'!I11","v":0},0,0]
[{"$f":"'J3'!I12","v":0},0,0]
[{"$f":"'J3'!I13","v":0},0,0]
[{"$f":"'J3'!I14","v":0},0,0]
[{"$f":"'J3'!I15","v":0},0,0]
[{"$f":"'J3'!I16","v":0},0,0]
[{"$f":"'J3'!I18","v":0},0,0]
[{"$f":"'J3'!I19","v":0},0,0]
[{"$f":"'J3'!I20","v":0},0,0]
[{"$f":"'J3'!I21","v":0},0,0]
[{"$f":"'J3'!I9","v":0},0,0]
[{"$f":"'J3'!J10","v":0},0,0]
[{"$f":"'J3'!J11","v":0},0,0]
[{"$f":"'J3'!J12","v":0},0,0]
[{"$f":"'J3'!J13","v":0},0,0]
[{"$f":"'J3'!J14","v":0},0,0]
[{"$f":"'J3'!J15","v":0},0,0]
[{"$f":"'J3'!J16","v":0},0,0]
[{"$f":"'J3'!J18","v":0},0,0]
[{"$f":"'J3'!J19","v":0},0,0]
[{"$f":"'J3'!J20","v":0},0,0]
[{"$f":"'J3'!J21","v":0},0,0]
[{"$f":"'J3'!J9","v":0},0,0]
[{"$f":"'J3'!K10","v":0},0,0]
[{"$f":"'J3'!K11","v":0},0,0]
[{"$f":"'J3'!K12","v":0},0,0]
[{"$f":"'J3'!K13","v":0},0,0]
[{"$f":"'J3'!K14","v":0},0,0]
[{"$f":"'J3'!K15","v":0},0,0]
[{"$f":"'J3'!K16","v":0},0,0]
[{"$f":"'J3'!K17","v":0},0,0]
[{"$f":"'J3'!K18","v":0},0,0]
[{"$f":"'J3'!K19","v":0},0,0]
[{"$f":"'J3'!K20","v":0},0,0]
[{"$f":"'J3'!K21","v":0},0,0]
[{"$f":"'J3'!K9","v":0},0,0]
[{"$f":"'J3'!L10","v":0},0,0]
[{"$f":"'J3'!L11","v":0},0,0]
[{"$f":"'J3'!L12","v":0},0,0]
[{"$f":"'J3'!L13","v":0},0,0]
[{"$f":"'J3'!L14","v":0},0,0]
[{"$f":"'J3'!L15","v":0},0,0]
[{"$f":"'J3'!L16","v":0},0,{"$f":"A2564*B2564","v":0}]
[{"$f":"'J3'!L17","v":0},0,0]
[{"$f":"'J3'!L18","v":0},0,0]
[{"$f":"'J3'!L19","v":0},0,0]
[{"$f":"'J3'!L20","v":0},0,0]
[{"$f":"'J3'!L21","v":0},0,0]
[{"$f":"'J3'!L9","v":0},0,0]
[{"$f":"'J4'!E10","v":0},0,0]
[{"$f":"'J4'!E11","v":0},0,0]
[{"$f":"'J4'!E12","v":0},0,0]
[{"$f":"'J4'!E13","v":0},0,0]
[{"$f":"'J4'!E14","v":0},0,0]
[{"$f":"'J4'!E15","v":0},0,0]
[{"$f":"'J4'!E16","v":0},0,0]
[{"$f":"'J4'!E17","v":0},0,0]
[{"$f":"'J4'!E18","v":0},0,0]
[{"$f":"'J4'!E19","v":0},0,0]
[{"$f":"'J4'!E20","v":0},0,0]
[{"$f":"'J4'!E21","v":0},0,0]
[{"$f":"'J4'!E9","v":0},0,0]
[{"$f":"'J4'!F10","v":0},0,0]
[{"$f":"'J4'!F11","v":0},0,0]
[{"$f":"'J4'!F12","v":0},0,0]
[{"$f":"'J4'!F13","v":0},0,0]
[{"$f":"'J4'!F14","v":0},0,0]
[{"$f":"'J4'!F15","v":0},0,0]
[{"$f":"'J4'!F16","v":0},0,0]
[{"$f":"'J4'!F17","v":0},0,0]
[{"$f":"'J4'!F18","v":0},0,0]
[{"$f":"'J4'!F19","v":0},0,0]
[{"$f":"'J4'!F20","v":0},0,0]
[{"$f":"'J4'!F21","v":0},0,0]
[{"$f":"'J4'!F9","v":0},0,0]
[{"$f":"'J4'!G10","v":0},0,0]
[{"$f":"'J4'!G11","v":0},0,0]
[{"$f":"'J4'!G12","v":0},0,0]
[{"$f":"'J4'!G13","v":0},0,0]
[{"$f":"'J4'!G14","v":0},0,0]
[{"$f":"'J4'!G15","v":0},0,0]
[{"$f":"'J4'!G16","v":0},0,0]
[{"$f":"'J4'!G18","v":0},0,0]
[{"$f":"'J4'!G19","v":0},0,0]
[{"$f":"'J4'!G20","v":0},0,0]
[{"$f":"'J4'!G21","v":0},0,0]
[{"$f":"'J4'!G9","v":0},0,0]
[{"$f":"'J4'!H10","v":0},0,0]
[{"$f":"'J4'!H11","v":0},0,0]
[{"$f":"'J4'!H12","v":0},0,0]
[{"$f":"'J4'!H13","v":0},0,0]
[{"$f":"'J4'!H14","v":0},0,0]
[{"$f":"'J4'!H15","v":0},0,0]
[{"$f":"'J4'!H16","v":0},0,0]
[{"$f":"'J4'!H18","v":0},0,0]
[{"$f":"'J4'!H19","v":0},0,0]
[{"$f":"'J4'!H20","v":0},0,0]
[{"$f":"'J4'!H21","v":0},0,0]
[{"$f":"'J4'!H9","v":0},0,0]
[{"$f":"'J4'!I10","v":0},0,0]
[{"$f":"'J4'!I11","v":0},0,0]
[{"$f":"'J4'!I12","v":0},0,0]
[{"$f":"'J4'!I13","v":0},0,0]
[{"$f":"'J4'!I14","v":0},0,0]
[{"$f":"'J4'!I15","v":0},0,0]
[{"$f":"'J4'!I16","v":0},0,0]
[{"$f":"'J4'!I18","v":0},0,{"$f":"A2628*B2628","v":0}]
[{"$f":"'J4'!I19","v":0},0,0]
[{"$f":"'J4'!I20","v":0},0,0]
[{"$f":"'J4'!I21","v":0},0,0]
[{"$f":"'J4'!I9","v":0},0,0]
[{"$f":"'J4'!J10","v":0},0,0]
[{"$f":"'J4'!J11","v":0},0,0]
[{"$f":"'J4'!J12","v":0},0,0]
[{"$f":"'J4'!J13","v":0},0,0]
[{"$f":"'J4'!J14","v":0},0,0]
[{"$f":"'J4'!J15","v":0},0,0]
[{"$f":"'J4'!J16","v":0},0,0]
[{"$f":"'J4'!J18","v":0},0,0]
[{"$f":"'J4'!J19","v":0},0,0]
[{"$f":"'J4'!J20","v":0},0,0]
[{"$f":"'J4'!J21","v":0},0,0]
[{"$f":"'J4'!J9","v":0},0,0]
[{"$f":"'J4'!K10","v":0},0,0]
[{"$f":"'J4'!K11","v":0},0,0]
[{"$f":"'J4'!K12","v":0},0,0]
[{"$f":"'J4'!K13","v":0},0,0]
[{"$f":"'J4'!K14","v":0},0,0]
[{"$f":"'J4'!K15","v":0},0,0]
[{"$f":"'J4'!K16","v":0},0,0]
[{"$f":"'J4'!K17","v":0},0,0]
[{"$f":"'J4'!K18","v":0},0,0]
[{"$f":"'J4'!K19","v":0},0,0]
[{"$f":"'J4'!K20","v":0},0,0]
[{"$f":"'J4'!K21","v":0},0,0]
[{"$f":"'J4'!K9","v":0},0,0]
[{"$f":"'J4'!L10","v":0},0,0]
[{"$f":"'J4'!L11","v":0},0,0]
[{"$f":"'J4'!L12","v":0},0,0]
[{"$f":"'J4'!L13","v":0},0,0]
[{"$f":"'J4'!L14","v":0},0,0]
[{"$f":"'J4'!L15","v":0},0,0]
[{"$f":"'J4'!L16","v":0},0,0]
[{"$f":"'J4'!L17","v":0},0,0]
[{"$f":"'J4'!L18","v":0},0,0]
[{"$f":"'J4'!L19","v":0},0,0]
[{"$f":"'J4'!L20","v":0},0,0]
[{"$f":"'J4'!L21","v":0},0,0]
[{"$f":"'J4'!L9","v":0},0,0]
[{"$f":"L!E9","v":0},0,0]
[{"$f":"L!E11","v":0},0,0]
[{"$f":"L!F6","v":0},686,0]
[{"$f":"L!F7","v":0},686,0]
[{"$f":"L!F8","v":0},686,0]
[{"$f":"L!F9","v":0},686,0]
[{"$f":"L!F10","v":0},686,0]
[{"$f":"L!F11","v":0},686,0]
[{"$f":"L!F12","v":0},686,0]
[{"$f":"L!F13","v":0},686,0]
[{"$f":"L!G12","v":0},0,0]
[{"$f":"L!G13","v":0},0,0]
[{"$f":"L!H6","v":0},0,0]
[{"$f":"L!H7","v":0},0,0]
[{"$f":"L!H8","v":0},0,0]
[{"$f":"L!H9","v":0},0,0]
[{"$f":"L!H10","v":0},0,0]
[{"$f":"L!H11","v":0},0,0]
[{"$f":"L!H12","v":0},0,0]
[{"$f":"L!H13","v":0},0,0]
[{"$f":"L!I6","v":0},0,0]
[{"$f":"L!I7","v":0},0,{"$f":"A2692*B2692","v":0}]
[{"$f":"L!I8","v":0},0,0]
[{"$f":"L!I9","v":0},0,0]
[{"$f":"L!I10","v":0},0,0]
[{"$f":"L!I11","v":0},0,0]
[{"$f":"L!I12","v":0},0,0]
[{"$f":"L!I13","v":0},0,0]
[{"$f":"L!J6","v":0},0,0]
[{"$f":"L!J7","v":0},0,0]
[{"$f":"L!J8","v":0},0,0]
[{"$f":"L!J9","v":0},0,0]
[{"$f":"L!J10","v":0},0,0]
[{"$f":"L!J11","v":0},0,0]
[{"$f":"L!J12","v":0},0,0]
[{"$f":"L!J13","v":0},0,0]
[{"$f":"'O1-1A'!E10","v":0},0,{"$f":"A2707*B2707","v":0}]
[{"$f":"'O1-1A'!E11","v":0},0,0]
[{"$f":"'O1-1A'!E12","v":0},0,0]
[{"$f":"'O1-1A'!E13","v":0},0,0]
[{"$f":"'O1-1A'!E14","v":0},0,0]
[{"$f":"'O1-1A'!E15","v":0},0,0]
[{"$f":"'O1-1A'!E16","v":0},0,0]
[{"$f":"'O1-1A'!E17","v":0},0,0]
[{"$f":"'O1-1A'!E18","v":0},0,0]
[{"$f":"'O1-1A'!E19","v":0},0,0]
[{"$f":"'O1-1A'!E20","v":0},0,0]
[{"$f":"'O1-1A'!E21","v":0},0,0]
[{"$f":"'O1-1A'!E22","v":0},0,0]
[{"$f":"'O1-1A'!E23","v":0},0,0]
[{"$f":"'O1-1A'!E24","v":0},0,0]
[{"$f":"'O1-1A'!E25","v":0},0,0]
[{"$f":"'O1-1A'!E26","v":0},0,0]
[{"$f":"'O1-1A'!E27","v":0},0,0]
[{"$f":"'O1-1A'!E28","v":0},0,0]
[{"$f":"'O1-1A'!E29","v":0},0,0]
[{"$f":"'O1-1A'!E30","v":0},0,0]
[{"$f":"'O1-1A'!E31","v":0},0,{"$f":"A2728*B2728","v":0}]
[{"$f":"'O1-1A'!E32","v":0},0,0]
[{"$f":"'O1-1A'!E33","v":0},0,0]
[{"$f":"'O1-1A'!E34","v":0},0,0]
[{"$f":"'O1-1A'!E35","v":0},0,0]
[{"$f":"'O1-1A'!E40","v":0},0,0]
[{"$f":"'O1-1A'!E41","v":0},0,0]
[{"$f":"'O1-1A'!E42","v":0},0,0]
[{"$f":"'O1-1A'!E43","v":0},0,0]
[{"$f":"'O1-1A'!E44","v":0},0,0]
[{"$f":"'O1-1A'!E45","v":0},0,0]
[{"$f":"'O1-1A'!E46","v":0},0,0]
[{"$f":"'O1-1A'!E47","v":0},0,0]
[{"$f":"'O1-1A'!E48","v":0},0,0]
[{"$f":"'O1-1A'!E49","v":0},0,0]
[{"$f":"'O1-1A'!E50","v":0},0,0]
[{"$f":"'O1-1A'!E51","v":0},0,0]
[{"$f":"'O1-1A'!F10","v":0},0,0]
[{"$f":"'O1-1A'!F11","v":0},0,0]
[{"$f":"'O1-1A'!F12","v":0},0,0]
[{"$f":"'O1-1A'!F13","v":0},0,0]
[{"$f":"'O1-1A'!F14","v":0},0,0]
[{"$f":"'O1-1A'!F15","v":0},0,0]
[{"$f":"'O1-1A'!F16","v":0},0,0]
[{"$f":"'O1-1A'!F17","v":0},0,0]
[{"$f":"'O1-1A'!F18","v":0},0,0]
[{"$f":"'O1-1A'!F19","v":0},0,0]
[{"$f":"'O1-1A'!F20","v":0},0,0]
[{"$f":"'O1-1A'!F21","v":0},0,0]
[{"$f":"'O1-1A'!F22","v":0},0,0]
[{"$f":"'O1-1A'!F23","v":0},0,0]
[{"$f":"'O1-1A'!F24","v":0},0,0]
[{"$f":"'O1-1A'!F25","v":0},0,0]
[{"$f":"'O1-1A'!F26","v":0},0,0]
[{"$f":"'O1-1A'!F27","v":0},0,0]
[{"$f":"'O1-1A'!F28","v":0},0,0]
[{"$f":"'O1-1A'!F29","v":0},0,0]
[{"$f":"'O1-1A'!F30","v":0},0,0]
[{"$f":"'O1-1A'!F31","v":0},0,0]
[{"$f":"'O1-1A'!F32","v":0},0,0]
[{"$f":"'O1-1A'!F33","v":0},0,0]
[{"$f":"'O1-1A'!F34","v":0},0,0]
[{"$f":"'O1-1A'!F35","v":0},0,0]
[{"$f":"'O1-1A'!G10","v":0},0,0]
[{"$f":"'O1-1A'!G11","v":0},0,0]
[{"$f":"'O1-1A'!G12","v":0},0,0]
[{"$f":"'O1-1A'!G13","v":0},0,0]
[{"$f":"'O1-1A'!G14","v":0},0,0]
[{"$f":"'O1-1A'!G15","v":0},0,0]
[{"$f":"'O1-1A'!G16","v":0},0,0]
[{"$f":"'O1-1A'!G17","v":0},0,0]
[{"$f":"'O1-1A'!G18","v":0},0,0]
[{"$f":"'O1-1A'!G19","v":0},0,0]
[{"$f":"'O1-1A'!G20","v":0},0,0]
[{"$f":"'O1-1A'!G21","v":0},0,0]
[{"$f":"'O1-1A'!G22","v":0},0,0]
[{"$f":"'O1-1A'!G23","v":0},0,0]
[{"$f":"'O1-1A'!G24","v":0},0,0]
[{"$f":"'O1-1A'!G25","v":0},0,0]
[{"$f":"'O1-1A'!G26","v":0},0,0]
[{"$f":"'O1-1A'!G27","v":0},0,0]
[{"$f":"'O1-1A'!G28","v":0},0,0]
[{"$f":"'O1-1A'!G29","v":0},0,0]
[{"$f":"'O1-1A'!G30","v":0},0,0]
[{"$f":"'O1-1A'!G31","v":0},0,{"$f":"A2792*B2792","v":0}]
[{"$f":"'O1-1A'!G32","v":0},0,0]
[{"$f":"'O1-1A'!G33","v":0},0,0]
[{"$f":"'O1-1A'!G34","v":0},0,0]
[{"$f":"'O1-1A'!G35","v":0},0,0]
[{"$f":"'O1-1A'!G40","v":0},0,0]
[{"$f":"'O1-1A'!G41","v":0},0,0]
[{"$f":"'O1-1A'!G42","v":0},0,0]
[{"$f":"'O1-1A'!G43","v":0},0,0]
[{"$f":"'O1-1A'!G44","v":0},0,0]
[{"$f":"'O1-1A'!G45","v":0},0,0]
[{"$f":"'O1-1A'!G46","v":0},0,0]
[{"$f":"'O1-1A'!G47","v":0},0,0]
[{"$f":"'O1-1A'!G48","v":0},0,0]
[{"$f":"'O1-1A'!G49","v":0},0,0]
[{"$f":"'O1-1A'!G50","v":0},0,0]
[{"$f":"'O1-1A'!G51","v":0},0,0]
[{"$f":"'O1-1A'!H10","v":0},0,0]
[{"$f":"'O1-1A'!H11","v":0},0,0]
[{"$f":"'O1-1A'!H12","v":0},0,0]
[{"$f":"'O1-1A'!H13","v":0},0,0]
[{"$f":"'O1-1A'!H14","v":0},0,0]
[{"$f":"'O1-1A'!H15","v":0},0,0]
[{"$f":"'O1-1A'!H16","v":0},0,0]
[{"$f":"'O1-1A'!H17","v":0},0,0]
[{"$f":"'O1-1A'!H18","v":0},0,0]
[{"$f":"'O1-1A'!H19","v":0},0,0]
[{"$f":"'O1-1A'!H20","v":0},0,0]
[{"$f":"'O1-1A'!H21","v":0},0,0]
[{"$f":"'O1-1A'!H22","v":0},0,0]
[{"$f":"'O1-1A'!H23","v":0},0,0]
[{"$f":"'O1-1A'!H24","v":0},0,0]
[{"$f":"'O1-1A'!H25","v":0},0,0]
[{"$f":"'O1-1A'!H26","v":0},0,0]
[{"$f":"'O1-1A'!H27","v":0},0,0]
[{"$f":"'O1-1A'!H28","v":0},0,0]
[{"$f":"'O1-1A'!H29","v":0},0,0]
[{"$f":"'O1-1A'!H30","v":0},0,0]
[{"$f":"'O1-1A'!H31","v":0},0,0]
[{"$f":"'O1-1A'!H32","v":0},0,0]
[{"$f":"'O1-1A'!H33","v":0},0,0]
[{"$f":"'O1-1A'!H34","v":0},0,0]
[{"$f":"'O1-1A'!H35","v":0},0,0]
[{"$f":"'O1-1A'!I10","v":0},0,0]
[{"$f":"'O1-1A'!I11","v":0},0,0]
[{"$f":"'O1-1A'!I12","v":0},0,0]
[{"$f":"'O1-1A'!I13","v":0},0,0]
[{"$f":"'O1-1A'!I14","v":0},0,0]
[{"$f":"'O1-1A'!I15","v":0},0,0]
[{"$f":"'O1-1A'!I16","v":0},0,0]
[{"$f":"'O1-1A'!I17","v":0},0,0]
[{"$f":"'O1-1A'!I18","v":0},0,0]
[{"$f":"'O1-1A'!I19","v":0},0,0]
[{"$f":"'O1-1A'!I20","v":0},0,0]
[{"$f":"'O1-1A'!I21","v":0},0,0]
[{"$f":"'O1-1A'!I22","v":0},0,0]
[{"$f":"'O1-1A'!I23","v":0},0,0]
[{"$f":"'O1-1A'!I24","v":0},0,0]
[{"$f":"'O1-1A'!I25","v":0},0,0]
[{"$f":"'O1-1A'!I26","v":0},0,0]
[{"$f":"'O1-1A'!I27","v":0},0,0]
[{"$f":"'O1-1A'!I28","v":0},0,0]
[{"$f":"'O1-1A'!I29","v":0},0,0]
[{"$f":"'O1-1A'!I30","v":0},0,0]
[{"$f":"'O1-1A'!I31","v":0},0,{"$f":"A2856*B2856","v":0}]
[{"$f":"'O1-1A'!I32","v":0},0,0]
[{"$f":"'O1-1A'!I33","v":0},0,0]
[{"$f":"'O1-1A'!I34","v":0},0,0]
[{"$f":"'O1-1A'!I35","v":0},0,0]
[{"$f":"'O1-1A'!I40","v":0},0,0]
[{"$f":"'O1-1A'!I41","v":0},0,0]
[{"$f":"'O1-1A'!I42","v":0},0,0]
[{"$f":"'O1-1A'!I43","v":0},0,0]
[{"$f":"'O1-1A'!I44","v":0},0,0]
[{"$f":"'O1-1A'!I45","v":0},0,0]
[{"$f":"'O1-1A'!I46","v":0},0,0]
[{"$f":"'O1-1A'!I47","v":0},0,0]
[{"$f":"'O1-1A'!I48","v":0},0,0]
[{"$f":"'O1-1A'!I49","v":0},0,0]
[{"$f":"'O1-1A'!I50","v":0},0,0]
[{"$f":"'O1-1A'!I51","v":0},0,0]
[{"$f":"'O1-1A'!J10","v":0},0,0]
[{"$f":"'O1-1A'!J11","v":0},0,0]
[{"$f":"'O1-1A'!J12","v":0},0,0]
[{"$f":"'O1-1A'!J13","v":0},0,0]
[{"$f":"'O1-1A'!J14","v":0},0,0]
[{"$f":"'O1-1A'!J15","v":0},0,0]
[{"$f":"'O1-1A'!J16","v":0},0,0]
[{"$f":"'O1-1A'!J17","v":0},0,0]
[{"$f":"'O1-1A'!J18","v":0},0,0]
[{"$f":"'O1-1A'!J19","v":0},0,0]
[{"$f":"'O1-1A'!J20","v":0},0,0]
[{"$f":"'O1-1A'!J21","v":0},0,0]
[{"$f":"'O1-1A'!J22","v":0},0,0]
[{"$f":"'O1-1A'!J23","v":0},0,0]
[{"$f":"'O1-1A'!J24","v":0},0,0]
[{"$f":"'O1-1A'!J25","v":0},0,0]
[{"$f":"'O1-1A'!J26","v":0},0,0]
[{"$f":"'O1-1A'!J27","v":0},0,0]
[{"$f":"'O1-1A'!J28","v":0},0,0]
[{"$f":"'O1-1A'!J29","v":0},0,0]
[{"$f":"'O1-1A'!J30","v":0},0,0]
[{"$f":"'O1-1A'!J31","v":0},0,0]
[{"$f":"'O1-1A'!J32","v":0},0,0]
[{"$f":"'O1-1A'!J33","v":0},0,0]
[{"$f":"'O1-1A'!J34","v":0},0,0]
[{"$f":"'O1-1A'!J35","v":0},0,0]
[{"$f":"'O1-1A'!K10","v":0},0,0]
[{"$f":"'O1-1A'!K11","v":0},0,0]
[{"$f":"'O1-1A'!K12","v":0},0,0]
[{"$f":"'O1-1A'!K13","v":0},0,0]
[{"$f":"'O1-1A'!K14","v":0},0,0]
[{"$f":"'O1-1A'!K15","v":0},0,0]
[{"$f":"'O1-1A'!K16","v":0},0,0]
[{"$f":"'O1-1A'!K17","v":0},0,0]
[{"$f":"'O1-1A'!K18","v":0},0,0]
[{"$f":"'O1-1A'!K19","v":0},0,0]
[{"$f":"'O1-1A'!K20","v":0},0,0]
[{"$f":"'O1-1A'!K21","v":0},0,0]
[{"$f":"'O1-1A'!K22","v":0},0,0]
[{"$f":"'O1-1A'!K23","v":0},0,0]
[{"$f":"'O1-1A'!K24","v":0},0,0]
[{"$f":"'O1-1A'!K25","v":0},0,0]
[{"$f":"'O1-1A'!K26","v":0},0,0]
[{"$f":"'O1-1A'!K27","v":0},0,0]
[{"$f":"'O1-1A'!K28","v":0},0,0]
[{"$f":"'O1-1A'!K29","v":0},0,0]
[{"$f":"'O1-1A'!K30","v":0},0,0]
[{"$f":"'O1-1A'!K31","v":0},0,{"$f":"A2920*B2920","v":0}]
[{"$f":"'O1-1A'!K32","v":0},0,0]
[{"$f":"'O1-1A'!K33","v":0},0,0]
[{"$f":"'O1-1A'!K34","v":0},0,0]
[{"$f":"'O1-1A'!K35","v":0},0,0]
[{"$f":"'O1-1A'!K40","v":0},0,0]
[{"$f":"'O1-1A'!K41","v":0},0,0]
[{"$f":"'O1-1A'!K42","v":0},0,0]
[{"$f":"'O1-1A'!K43","v":0},0,0]
[{"$f":"'O1-1A'!K44","v":0},0,0]
[{"$f":"'O1-1A'!K45","v":0},0,0]
[{"$f":"'O1-1A'!K46","v":0},0,0]
[{"$f":"'O1-1A'!K47","v":0},0,0]
[{"$f":"'O1-1A'!K48","v":0},0,0]
[{"$f":"'O1-1A'!K49","v":0},0,0]
[{"$f":"'O1-1A'!K50","v":0},0,0]
[{"$f":"'O1-1A'!K51","v":0},0,0]
[{"$f":"'O1-1A'!L10","v":0},0,0]
[{"$f":"'O1-1A'!L11","v":0},0,0]
[{"$f":"'O1-1A'!L12","v":0},0,0]
[{"$f":"'O1-1A'!L13","v":0},0,0]
[{"$f":"'O1-1A'!L14","v":0},0,0]
[{"$f":"'O1-1A'!L15","v":0},0,0]
[{"$f":"'O1-1A'!L16","v":0},0,0]
[{"$f":"'O1-1A'!L17","v":0},0,0]
[{"$f":"'O1-1A'!L18","v":0},0,0]
[{"$f":"'O1-1A'!L19","v":0},0,0]
[{"$f":"'O1-1A'!L20","v":0},0,0]
[{"$f":"'O1-1A'!L21","v":0},0,0]
[{"$f":"'O1-1A'!L22","v":0},0,0]
[{"$f":"'O1-1A'!L23","v":0},0,0]
[{"$f":"'O1-1A'!L24","v":0},0,0]
[{"$f":"'O1-1A'!L25","v":0},0,0]
[{"$f":"'O1-1A'!L26","v":0},0,0]
[{"$f":"'O1-1A'!L27","v":0},0,0]
[{"$f":"'O1-1A'!L28","v":0},0,0]
[{"$f":"'O1-1A'!L29","v":0},0,0]
[{"$f":"'O1-1A'!L30","v":0},0,0]
[{"$f":"'O1-1A'!L31","v":0},0,0]
[{"$f":"'O1-1A'!L32","v":0},0,0]
[{"$f":"'O1-1A'!L33","v":0},0,0]
[{"$f":"'O1-1A'!L34","v":0},0,0]
[{"$f":"'O1-1A'!L35","v":0},0,0]
[{"$f":"'O1-1A'!M10","v":0},0,0]
[{"$f":"'O1-1A'!M11","v":0},0,0]
[{"$f":"'O1-1A'!M12","v":0},0,0]
[{"$f":"'O1-1A'!M13","v":0},0,0]
[{"$f":"'O1-1A'!M14","v":0},0,0]
[{"$f":"'O1-1A'!M15","v":0},0,0]
[{"$f":"'O1-1A'!M16","v":0},0,0]
[{"$f":"'O1-1A'!M17","v":0},0,0]
[{"$f":"'O1-1A'!M18","v":0},0,0]
[{"$f":"'O1-1A'!M19","v":0},0,0]
[{"$f":"'O1-1A'!M20","v":0},0,0]
[{"$f":"'O1-1A'!M21","v":0},0,0]
[{"$f":"'O1-1A'!M22","v":0},0,0]
[{"$f":"'O1-1A'!M23","v":0},0,0]
[{"$f":"'O1-1A'!M24","v":0},0,0]
[{"$f":"'O1-1A'!M25","v":0},0,0]
[{"$f":"'O1-1A'!M26","v":0},0,0]
[{"$f":"'O1-1A'!M27","v":0},0,0]
[{"$f":"'O1-1A'!M28","v":0},0,0]
[{"$f":"'O1-1A'!M29","v":0},0,0]
[{"$f":"'O1-1A'!M30","v":0},0,0]
[{"$f":"'O1-1A'!M31","v":0},0,{"$f":"A2984*B2984","v":0}]
[{"$f":"'O1-1A'!M32","v":0},0,0]
[{"$f":"'O1-1A'!M33","v":0},0,0]
[{"$f":"'O1-1A'!M34","v":0},0,0]
[{"$f":"'O1-1A'!M35","v":0},0,0]
[{"$f":"'O1-1A'!N10","v":0},0,0]
[{"$f":"'O1-1A'!N11","v":0},0,0]
[{"$f":"'O1-1A'!N12","v":0},0,0]
[{"$f":"'O1-1A'!N13","v":0},0,0]
[{"$f":"'O1-1A'!N14","v":0},0,0]
[{"$f":"'O1-1A'!N15","v":0},0,0]
[{"$f":"'O1-1A'!N16","v":0},0,0]
[{"$f":"'O1-1A'!N17","v":0},0,0]
[{"$f":"'O1-1A'!N18","v":0},0,0]
[{"$f":"'O1-1A'!N19","v":0},0,0]
[{"$f":"'O1-1A'!N20","v":0},0,0]
[{"$f":"'O1-1A'!N21","v":0},0,0]
[{"$f":"'O1-1A'!N22","v":0},0,0]
[{"$f":"'O1-1A'!N23","v":0},0,0]
[{"$f":"'O1-1A'!N24","v":0},0,0]
[{"$f":"'O1-1A'!N25","v":0},0,0]
[{"$f":"'O1-1A'!N26","v":0},0,0]
[{"$f":"'O1-1A'!N27","v":0},0,0]
[{"$f":"'O1-1A'!N28","v":0},0,0]
[{"$f":"'O1-1A'!N29","v":0},0,0]
[{"$f":"'O1-1A'!N30","v":0},0,0]
[{"$f":"'O1-1A'!N31","v":0},0,0]
[{"$f":"'O1-1A'!N32","v":0},0,0]
[{"$f":"'O1-1A'!N33","v":0},0,0]
[{"$f":"'O1-1A'!N34","v":0},0,0]
[{"$f":"'O1-1A'!N35","v":0},0,0]
[{"$f":"'O1-1A'!O10","v":0},0,0]
[{"$f":"'O1-1A'!O11","v":0},0,0]
[{"$f":"'O1-1A'!O12","v":0},0,0]
[{"$f":"'O1-1A'!O13","v":0},0,0]
[{"$f":"'O1-1A'!O14","v":0},0,0]
[{"$f":"'O1-1A'!O15","v":0},0,0]
[{"$f":"'O1-1A'!O16","v":0},0,0]
[{"$f":"'O1-1A'!O17","v":0},0,0]
[{"$f":"'O1-1A'!O18","v":0},0,0]
[{"$f":"'O1-1A'!O19","v":0},0,0]
[{"$f":"'O1-1A'!O20","v":0},0,0]
[{"$f":"'O1-1A'!O21","v":0},0,0]
[{"$f":"'O1-1A'!O22","v":0},0,0]
[{"$f":"'O1-1A'!O23","v":0},0,0]
[{"$f":"'O1-1A'!O24","v":0},0,0]
[{"$f":"'O1-1A'!O25","v":0},0,0]
[{"$f":"'O1-1A'!O26","v":0},0,0]
[{"$f":"'O1-1A'!O27","v":0},0,0]
[{"$f":"'O1-1A'!O28","v":0},0,0]
[{"$f":"'O1-1A'!O29","v":0},0,0]
[{"$f":"'O1-1A'!O30","v":0},0,0]
[{"$f":"'O1-1A'!O31","v":0},0,0]
[{"$f":"'O1-1A'!O32","v":0},0,0]
[{"$f":"'O1-1A'!O33","v":0},0,0]
[{"$f":"'O1-1A'!O34","v":0},0,0]
[{"$f":"'O1-1A'!O35","v":0},0,0]
[{"$f":"'O1-1A'!P10","v":0},0,0]
[{"$f":"'O1-1A'!P11","v":0},0,0]
[{"$f":"'O1-1A'!P12","v":0},0,0]
[{"$f":"'O1-1A'!P13","v":0},0,0]
[{"$f":"'O1-1A'!P14","v":0},0,0]
[{"$f":"'O1-1A'!P15","v":0},0,0]
[{"$f":"'O1-1A'!P16","v":0},0,0]
[{"$f":"'O1-1A'!P17","v":0},0,{"$f":"A3048*B3048","v":0}]
[{"$f":"'O1-1A'!P18","v":0},0,0]
[{"$f":"'O1-1A'!P19","v":0},0,0]
[{"$f":"'O1-1A'!P20","v":0},0,0]
[{"$f":"'O1-1A'!P21","v":0},0,0]
[{"$f":"'O1-1A'!P22","v":0},0,0]
[{"$f":"'O1-1A'!P23","v":0},0,0]
[{"$f":"'O1-1A'!P24","v":0},0,0]
[{"$f":"'O1-1A'!P25","v":0},0,0]
[{"$f":"'O1-1A'!P26","v":0},0,0]
[{"$f":"'O1-1A'!P27","v":0},0,0]
[{"$f":"'O1-1A'!P28","v":0},0,0]
[{"$f":"'O1-1A'!P29","v":0},0,0]
[{"$f":"'O1-1A'!P30","v":0},0,0]
[{"$f":"'O1-1A'!P31","v":0},0,0]
[{"$f":"'O1-1A'!P32","v":0},0,0]
[{"$f":"'O1-1A'!P33","v":0},0,0]
[{"$f":"'O1-1A'!P34","v":0},0,0]
[{"$f":"'O1-1A'!P35","v":0},0,0]
[{"$f":"'O1-1B'!E11","v":0},0,0]
[{"$f":"'O1-1B'!E12","v":0},0,0]
[{"$f":"'O1-1B'!E13","v":0},0,0]
[{"$f":"'O1-1B'!E14","v":0},0,0]
[{"$f":"'O1-1B'!E15","v":0},0,0]
[{"$f":"'O1-1B'!E16","v":0},0,0]
[{"$f":"'O1-1B'!E17","v":0},0,0]
[{"$f":"'O1-1B'!E18","v":0},0,0]
[{"$f":"'O1-1B'!E19","v":0},0,0]
[{"$f":"'O1-1B'!E20","v":0},0,0]
[{"$f":"'O1-1B'!E21","v":0},0,0]
[{"$f":"'O1-1B'!E22","v":0},0,0]
[{"$f":"'O1-1B'!E23","v":0},0,0]
[{"$f":"'O1-1B'!E24","v":0},0,0]
[{"$f":"'O1-1B'!E25","v":0},0,0]
[{"$f":"'O1-1B'!E26","v":0},0,0]
[{"$f":"'O1-1B'!E27","v":0},0,0]
[{"$f":"'O1-1B'!E28","v":0},0,0]
[{"$f":"'O1-1B'!E29","v":0},0,0]
[{"$f":"'O1-1B'!E30","v":0},0,0]
[{"$f":"'O1-1B'!E31","v":0},0,0]
[{"$f":"'O1-1B'!E32","v":0},0,0]
[{"$f":"'O1-1B'!E33","v":0},0,0]
[{"$f":"'O1-1B'!E34","v":0},0,0]
[{"$f":"'O1-1B'!E35","v":0},0,0]
[{"$f":"'O1-1B'!E42","v":0},0,0]
[{"$f":"'O1-1B'!E43","v":0},0,0]
[{"$f":"'O1-1B'!E44","v":0},0,0]
[{"$f":"'O1-1B'!E45","v":0},0,0]
[{"$f":"'O1-1B'!E46","v":0},0,0]
[{"$f":"'O1-1B'!E47","v":0},0,0]
[{"$f":"'O1-1B'!E48","v":0},0,0]
[{"$f":"'O1-1B'!E49","v":0},0,0]
[{"$f":"'O1-1B'!E50","v":0},0,0]
[{"$f":"'O1-1B'!F11","v":0},0,0]
[{"$f":"'O1-1B'!F12","v":0},0,0]
[{"$f":"'O1-1B'!F13","v":0},0,0]
[{"$f":"'O1-1B'!F14","v":0},0,0]
[{"$f":"'O1-1B'!F15","v":0},0,0]
[{"$f":"'O1-1B'!F16","v":0},0,0]
[{"$f":"'O1-1B'!F17","v":0},0,0]
[{"$f":"'O1-1B'!F18","v":0},0,0]
[{"$f":"'O1-1B'!F19","v":0},0,0]
[{"$f":"'O1-1B'!F20","v":0},0,0]
[{"$f":"'O1-1B'!F21","v":0},0,0]
[{"$f":"'O1-1B'!F22","v":0},0,{"$f":"A3112*B3112","v":0}]
[{"$f":"'O1-1B'!F23","v":0},0,0]
[{"$f":"'O1-1B'!F24","v":0},0,0]
[{"$f":"'O1-1B'!F25","v":0},0,0]
[{"$f":"'O1-1B'!F26","v":0},0,0]
[{"$f":"'O1-1B'!F27","v":0},0,0]
[{"$f":"'O1-1B'!F28","v":0},0,0]
[{"$f":"'O1-1B'!F29","v":0},0,0]
[{"$f":"'O1-1B'!F30","v":0},0,0]
[{"$f":"'O1-1B'!F31","v":0},0,0]
[{"$f":"'O1-1B'!F32","v":0},0,0]
[{"$f":"'O1-1B'!F33","v":0},0,0]
[{"$f":"'O1-1B'!F34","v":0},0,0]
[{"$f":"'O1-1B'!F35","v":0},0,0]
[{"$f":"'O1-1B'!G11","v":0},0,0]
[{"$f":"'O1-1B'!G12","v":0},0,0]
[{"$f":"'O1-1B'!G13","v":0},0,0]
[{"$f":"'O1-1B'!G14","v":0},0,0]
[{"$f":"'O1-1B'!G15","v":0},0,0]
[{"$f":"'O1-1B'!G16","v":0},0,0]
[{"$f":"'O1-1B'!G17","v":0},0,0]
[{"$f":"'O1-1B'!G18","v":0},0,0]
[{"$f":"'O1-1B'!G19","v":0},0,0]
[{"$f":"'O1-1B'!G20","v":0},0,0]
[{"$f":"'O1-1B'!G21","v":0},0,0]
[{"$f":"'O1-1B'!G22","v":0},0,0]
[{"$f":"'O1-1B'!G23","v":0},0,0]
[{"$f":"'O1-1B'!G24","v":0},0,0]
[{"$f":"'O1-1B'!G25","v":0},0,0]
[{"$f":"'O1-1B'!G26","v":0},0,0]
[{"$f":"'O1-1B'!G27","v":0},0,0]
[{"$f":"'O1-1B'!G28","v":0},0,0]
[{"$f":"'O1-1B'!G29","v":0},0,0]
[{"$f":"'O1-1B'!G30","v":0},0,0]
[{"$f":"'O1-1B'!G31","v":0},0,0]
[{"$f":"'O1-1B'!G32","v":0},0,0]
[{"$f":"'O1-1B'!G33","v":0},0,0]
[{"$f":"'O1-1B'!G34","v":0},0,0]
[{"$f":"'O1-1B'!G35","v":0},0,0]
[{"$f":"'O1-1B'!G42","v":0},0,0]
[{"$f":"'O1-1B'!G43","v":0},0,0]
[{"$f":"'O1-1B'!G44","v":0},0,0]
[{"$f":"'O1-1B'!G45","v":0},0,0]
[{"$f":"'O1-1B'!G46","v":0},0,0]
[{"$f":"'O1-1B'!G47","v":0},0,0]
[{"$f":"'O1-1B'!G48","v":0},0,0]
[{"$f":"'O1-1B'!G49","v":0},0,0]
[{"$f":"'O1-1B'!G50","v":0},0,0]
[{"$f":"'O1-1B'!H11","v":0},0,0]
[{"$f":"'O1-1B'!H12","v":0},0,0]
[{"$f":"'O1-1B'!H13","v":0},0,0]
[{"$f":"'O1-1B'!H14","v":0},0,0]
[{"$f":"'O1-1B'!H15","v":0},0,0]
[{"$f":"'O1-1B'!H16","v":0},0,0]
[{"$f":"'O1-1B'!H17","v":0},0,0]
[{"$f":"'O1-1B'!H18","v":0},0,0]
[{"$f":"'O1-1B'!H19","v":0},0,0]
[{"$f":"'O1-1B'!H20","v":0},0,0]
[{"$f":"'O1-1B'!H21","v":0},0,0]
[{"$f":"'O1-1B'!H22","v":0},0,0]
[{"$f":"'O1-1B'!H23","v":0},0,0]
[{"$f":"'O1-1B'!H24","v":0},0,0]
[{"$f":"'O1-1B'!H25","v":0},0,0]
[{"$f":"'O1-1B'!H26","v":0},0,0]
[{"$f":"'O1-1B'!H27","v":0},0,{"$f":"A3176*B3176","v":0}]
[{"$f":"'O1-1B'!H28","v":0},0,0]
[{"$f":"'O1-1B'!H29","v":0},0,0]
[{"$f":"'O1-1B'!H30","v":0},0,0]
[{"$f":"'O1-1B'!H31","v":0},0,0]
[{"$f":"'O1-1B'!H32","v":0},0,0]
[{"$f":"'O1-1B'!H33","v":0},0,0]
[{"$f":"'O1-1B'!H34","v":0},0,0]
[{"$f":"'O1-1B'!H35","v":0},0,0]
[{"$f":"'O1-1B'!I11","v":0},0,0]
[{"$f":"'O1-1B'!I12","v":0},0,0]
[{"$f":"'O1-1B'!I13","v":0},0,0]
[{"$f":"'O1-1B'!I14","v":0},0,0]
[{"$f":"'O1-1B'!I15","v":0},0,0]
[{"$f":"'O1-1B'!I16","v":0},0,0]
[{"$f":"'O1-1B'!I17","v":0},0,0]
[{"$f":"'O1-1B'!I18","v":0},0,0]
[{"$f":"'O1-1B'!I19","v":0},0,0]
[{"$f":"'O1-1B'!I20","v":0},0,0]
[{"$f":"'O1-1B'!I21","v":0},0,0]
[{"$f":"'O1-1B'!I22","v":0},0,0]
[{"$f":"'O1-1B'!I23","v":0},0,0]
[{"$f":"'O1-1B'!I24","v":0},0,0]
[{"$f":"'O1-1B'!I25","v":0},0,0]
[{"$f":"'O1-1B'!I26","v":0},0,0]
[{"$f":"'O1-1B'!I27","v":0},0,0]
[{"$f":"'O1-1B'!I28","v":0},0,0]
[{"$f":"'O1-1B'!I29","v":0},0,0]
[{"$f":"'O1-1B'!I30","v":0},0,0]
[{"$f":"'O1-1B'!I31","v":0},0,0]
[{"$f":"'O1-1B'!I32","v":0},0,0]
[{"$f":"'O1-1B'!I33","v":0},0,0]
[{"$f":"'O1-1B'!I34","v":0},0,0]
[{"$f":"'O1-1B'!I35","v":0},0,0]
[{"$f":"'O1-1B'!I42","v":0},0,0]
[{"$f":"'O1-1B'!I43","v":0},0,0]
[{"$f":"'O1-1B'!I44","v":0},0,0]
[{"$f":"'O1-1B'!I45","v":0},0,0]
[{"$f":"'O1-1B'!I46","v":0},0,0]
[{"$f":"'O1-1B'!I47","v":0},0,0]
[{"$f":"'O1-1B'!I48","v":0},0,0]
[{"$f":"'O1-1B'!I49","v":0},0,0]
[{"$f":"'O1-1B'!I50","v":0},0,0]
[{"$f":"'O1-1B'!J11","v":0},0,0]
[{"$f":"'O1-1B'!J12","v":0},0,0]
[{"$f":"'O1-1B'!J13","v":0},0,0]
[{"$f":"'O1-1B'!J14","v":0},0,0]
[{"$f":"'O1-1B'!J15","v":0},0,0]
[{"$f":"'O1-1B'!J16","v":0},0,0]
[{"$f":"'O1-1B'!J17","v":0},0,0]
[{"$f":"'O1-1B'!J18","v":0},0,0]
[{"$f":"'O1-1B'!J19","v":0},0,0]
[{"$f":"'O1-1B'!J20","v":0},0,0]
[{"$f":"'O1-1B'!J21","v":0},0,0]
[{"$f":"'O1-1B'!J22","v":0},0,0]
[{"$f":"'O1-1B'!J23","v":0},0,0]
[{"$f":"'O1-1B'!J24","v":0},0,0]
[{"$f":"'O1-1B'!J25","v":0},0,0]
[{"$f":"'O1-1B'!J26","v":0},0,0]
[{"$f":"'O1-1B'!J27","v":0},0,0]
[{"$f":"'O1-1B'!J28","v":0},0,0]
[{"$f":"'O1-1B'!J29","v":0},0,0]
[{"$f":"'O1-1B'!J30","v":0},0,0]
[{"$f":"'O1-1B'!J31","v":0},0,0]
[{"$f":"'O1-1B'!J32","v":0},0,{"$f":"A3240*B3240","v":0}]
[{"$f":"'O1-1B'!J33","v":0},0,0]
[{"$f":"'O1-1B'!J34","v":0},0,0]
[{"$f":"'O1-1B'!J35","v":0},0,0]
[{"$f":"'O1-1B'!K11","v":0},0,0]
[{"$f":"'O1-1B'!K12","v":0},0,0]
[{"$f":"'O1-1B'!K13","v":0},0,0]
[{"$f":"'O1-1B'!K14","v":0},0,0]
[{"$f":"'O1-1B'!K15","v":0},0,0]
[{"$f":"'O1-1B'!K16","v":0},0,0]
[{"$f":"'O1-1B'!K17","v":0},0,0]
[{"$f":"'O1-1B'!K18","v":0},0,0]
[{"$f":"'O1-1B'!K19","v":0},0,0]
[{"$f":"'O1-1B'!K20","v":0},0,0]
[{"$f":"'O1-1B'!K21","v":0},0,0]
[{"$f":"'O1-1B'!K22","v":0},0,0]
[{"$f":"'O1-1B'!K23","v":0},0,0]
[{"$f":"'O1-1B'!K24","v":0},0,0]
[{"$f":"'O1-1B'!K25","v":0},0,0]
[{"$f":"'O1-1B'!K26","v":0},0,0]
[{"$f":"'O1-1B'!K27","v":0},0,0]
[{"$f":"'O1-1B'!K28","v":0},0,0]
[{"$f":"'O1-1B'!K29","v":0},0,0]
[{"$f":"'O1-1B'!K30","v":0},0,0]
[{"$f":"'O1-1B'!K31","v":0},0,0]
[{"$f":"'O1-1B'!K32","v":0},0,0]
[{"$f":"'O1-1B'!K33","v":0},0,0]
[{"$f":"'O1-1B'!K34","v":0},0,0]
[{"$f":"'O1-1B'!K35","v":0},0,0]
[{"$f":"'O1-1B'!K42","v":0},0,0]
[{"$f":"'O1-1B'!K43","v":0},0,0]
[{"$f":"'O1-1B'!K44","v":0},0,0]
[{"$f":"'O1-1B'!K45","v":0},0,0]
[{"$f":"'O1-1B'!K46","v":0},0,0]
[{"$f":"'O1-1B'!K47","v":0},0,0]
[{"$f":"'O1-1B'!K48","v":0},0,0]
[{"$f":"'O1-1B'!K49","v":0},0,0]
[{"$f":"'O1-1B'!K50","v":0},0,0]
[{"$f":"'O1-1B'!L11","v":0},0,0]
[{"$f":"'O1-1B'!L12","v":0},0,0]
[{"$f":"'O1-1B'!L13","v":0},0,0]
[{"$f":"'O1-1B'!L14","v":0},0,0]
[{"$f":"'O1-1B'!L15","v":0},0,0]
[{"$f":"'O1-1B'!L16","v":0},0,0]
[{"$f":"'O1-1B'!L17","v":0},0,0]
[{"$f":"'O1-1B'!L18","v":0},0,0]
[{"$f":"'O1-1B'!L19","v":0},0,0]
[{"$f":"'O1-1B'!L20","v":0},0,0]
[{"$f":"'O1-1B'!L21","v":0},0,0]
[{"$f":"'O1-1B'!L22","v":0},0,0]
[{"$f":"'O1-1B'!L23","v":0},0,0]
[{"$f":"'O1-1B'!L24","v":0},0,0]
[{"$f":"'O1-1B'!L25","v":0},0,0]
[{"$f":"'O1-1B'!L26","v":0},0,0]
[{"$f":"'O1-1B'!L27","v":0},0,0]
[{"$f":"'O1-1B'!L28","v":0},0,0]
[{"$f":"'O1-1B'!L29","v":0},0,0]
[{"$f":"'O1-1B'!L30","v":0},0,0]
[{"$f":"'O1-1B'!L31","v":0},0,0]
[{"$f":"'O1-1B'!L32","v":0},0,0]
[{"$f":"'O1-1B'!L33","v":0},0,0]
[{"$f":"'O1-1B'!L34","v":0},0,0]
[{"$f":"'O1-1B'!L35","v":0},0,0]
[{"$f":"'O1-1B'!M11","v":0},0,0]
[{"$f":"'O1-1B'!M12","v":0},0,{"$f":"A3304*B3304","v":0}]
[{"$f":"'O1-1B'!M13","v":0},0,0]
[{"$f":"'O1-1B'!M14","v":0},0,0]
[{"$f":"'O1-1B'!M15","v":0},0,0]
[{"$f":"'O1-1B'!M16","v":0},0,0]
[{"$f":"'O1-1B'!M17","v":0},0,0]
[{"$f":"'O1-1B'!M18","v":0},0,0]
[{"$f":"'O1-1B'!M19","v":0},0,0]
[{"$f":"'O1-1B'!M20","v":0},0,0]
[{"$f":"'O1-1B'!M21","v":0},0,0]
[{"$f":"'O1-1B'!M22","v":0},0,0]
[{"$f":"'O1-1B'!M23","v":0},0,0]
[{"$f":"'O1-1B'!M24","v":0},0,0]
[{"$f":"'O1-1B'!M25","v":0},0,0]
[{"$f":"'O1-1B'!M26","v":0},0,0]
[{"$f":"'O1-1B'!M27","v":0},0,0]
[{"$f":"'O1-1B'!M28","v":0},0,0]
[{"$f":"'O1-1B'!M29","v":0},0,0]
[{"$f":"'O1-1B'!M30","v":0},0,0]
[{"$f":"'O1-1B'!M31","v":0},0,0]
[{"$f":"'O1-1B'!M32","v":0},0,0]
[{"$f":"'O1-1B'!M33","v":0},0,0]
[{"$f":"'O1-1B'!M34","v":0},0,0]
[{"$f":"'O1-1B'!M35","v":0},0,0]
[{"$f":"'O1-1B'!M42","v":0},0,0]
[{"$f":"'O1-1B'!M43","v":0},0,0]
[{"$f":"'O1-1B'!M44","v":0},0,0]
[{"$f":"'O1-1B'!M45","v":0},0,0]
[{"$f":"'O1-1B'!M46","v":0},0,0]
[{"$f":"'O1-1B'!M47","v":0},0,0]
[{"$f":"'O1-1B'!M48","v":0},0,0]
[{"$f":"'O1-1B'!M49","v":0},0,0]
[{"$f":"'O1-1B'!M50","v":0},0,0]
[{"$f":"'O1-1B'!N11","v":0},0,0]
[{"$f":"'O1-1B'!N12","v":0},0,0]
[{"$f":"'O1-1B'!N13","v":0},0,0]
[{"$f":"'O1-1B'!N14","v":0},0,0]
[{"$f":"'O1-1B'!N15","v":0},0,0]
[{"$f":"'O1-1B'!N16","v":0},0,0]
[{"$f":"'O1-1B'!N17","v":0},0,0]
[{"$f":"'O1-1B'!N18","v":0},0,0]
[{"$f":"'O1-1B'!N19","v":0},0,0]
[{"$f":"'O1-1B'!N20","v":0},0,0]
[{"$f":"'O1-1B'!N21","v":0},0,0]
[{"$f":"'O1-1B'!N22","v":0},0,0]
[{"$f":"'O1-1B'!N23","v":0},0,0]
[{"$f":"'O1-1B'!N24","v":0},0,0]
[{"$f":"'O1-1B'!N25","v":0},0,0]
[{"$f":"'O1-1B'!N26","v":0},0,0]
[{"$f":"'O1-1B'!N27","v":0},0,0]
[{"$f":"'O1-1B'!N28","v":0},0,0]
[{"$f":"'O1-1B'!N29","v":0},0,0]
[{"$f":"'O1-1B'!N30","v":0},0,0]
[{"$f":"'O1-1B'!N31","v":0},0,0]
[{"$f":"'O1-1B'!N32","v":0},0,0]
[{"$f":"'O1-1B'!N33","v":0},0,0]
[{"$f":"'O1-1B'!N34","v":0},0,0]
[{"$f":"'O1-1B'!N35","v":0},0,0]
[{"$f":"'O1-1B'!O11","v":0},0,0]
[{"$f":"'O1-1B'!O12","v":0},0,0]
[{"$f":"'O1-1B'!O13","v":0},0,0]
[{"$f":"'O1-1B'!O14","v":0},0,0]
[{"$f":"'O1-1B'!O15","v":0},0,0]
[{"$f":"'O1-1B'!O16","v":0},0,0]
[{"$f":"'O1-1B'!O17","v":0},0,{"$f":"A3368*B3368","v":0}]
[{"$f":"'O1-1B'!O18","v":0},0,0]
[{"$f":"'O1-1B'!O19","v":0},0,0]
[{"$f":"'O1-1B'!O20","v":0},0,0]
[{"$f":"'O1-1B'!O21","v":0},0,0]
[{"$f":"'O1-1B'!O22","v":0},0,0]
[{"$f":"'O1-1B'!O23","v":0},0,0]
[{"$f":"'O1-1B'!O24","v":0},0,0]
[{"$f":"'O1-1B'!O25","v":0},0,0]
[{"$f":"'O1-1B'!O26","v":0},0,0]
[{"$f":"'O1-1B'!O27","v":0},0,0]
[{"$f":"'O1-1B'!O28","v":0},0,0]
[{"$f":"'O1-1B'!O29","v":0},0,0]
[{"$f":"'O1-1B'!O30","v":0},0,0]
[{"$f":"'O1-1B'!O31","v":0},0,0]
[{"$f":"'O1-1B'!O32","v":0},0,0]
[{"$f":"'O1-1B'!O33","v":0},0,0]
[{"$f":"'O1-1B'!O34","v":0},0,0]
[{"$f":"'O1-1B'!O35","v":0},0,0]
[{"$f":"'O1-1B'!O42","v":0},0,0]
[{"$f":"'O1-1B'!O43","v":0},0,0]
[{"$f":"'O1-1B'!O44","v":0},0,0]
[{"$f":"'O1-1B'!O45","v":0},0,0]
[{"$f":"'O1-1B'!O46","v":0},0,0]
[{"$f":"'O1-1B'!O47","v":0},0,0]
[{"$f":"'O1-1B'!O48","v":0},0,0]
[{"$f":"'O1-1B'!O49","v":0},0,0]
[{"$f":"'O1-1B'!O50","v":0},0,0]
[{"$f":"'O1-1B'!P11","v":0},0,0]
[{"$f":"'O1-1B'!P12","v":0},0,0]
[{"$f":"'O1-1B'!P13","v":0},0,0]
[{"$f":"'O1-1B'!P14","v":0},0,0]
[{"$f":"'O1-1B'!P15","v":0},0,0]
[{"$f":"'O1-1B'!P16","v":0},0,0]
[{"$f":"'O1-1B'!P17","v":0},0,0]
[{"$f":"'O1-1B'!P18","v":0},0,0]
[{"$f":"'O1-1B'!P19","v":0},0,0]
[{"$f":"'O1-1B'!P20","v":0},0,0]
[{"$f":"'O1-1B'!P21","v":0},0,0]
[{"$f":"'O1-1B'!P22","v":0},0,0]
[{"$f":"'O1-1B'!P23","v":0},0,0]
[{"$f":"'O1-1B'!P24","v":0},0,0]
[{"$f":"'O1-1B'!P25","v":0},0,0]
[{"$f":"'O1-1B'!P26","v":0},0,0]
[{"$f":"'O1-1B'!P27","v":0},0,0]
[{"$f":"'O1-1B'!P28","v":0},0,0]
[{"$f":"'O1-1B'!P29","v":0},0,0]
[{"$f":"'O1-1B'!P30","v":0},0,0]
[{"$f":"'O1-1B'!P31","v":0},0,0]
[{"$f":"'O1-1B'!P32","v":0},0,0]
[{"$f":"'O1-1B'!P33","v":0},0,0]
[{"$f":"'O1-1B'!P34","v":0},0,0]
[{"$f":"'O1-1B'!P35","v":0},0,0]
[{"$f":"'O1-1B'!Q11","v":0},0,0]
[{"$f":"'O1-1B'!Q12","v":0},0,0]
[{"$f":"'O1-1B'!Q13","v":0},0,0]
[{"$f":"'O1-1B'!Q14","v":0},0,0]
[{"$f":"'O1-1B'!Q15","v":0},0,0]
[{"$f":"'O1-1B'!Q16","v":0},0,0]
[{"$f":"'O1-1B'!Q17","v":0},0,0]
[{"$f":"'O1-1B'!Q18","v":0},0,0]
[{"$f":"'O1-1B'!Q19","v":0},0,0]
[{"$f":"'O1-1B'!Q20","v":0},0,0]
[{"$f":"'O1-1B'!Q21","v":0},0,0]
[{"$f":"'O1-1B'!Q22","v":0},0,{"$f":"A3432*B3432","v":0}]
[{"$f":"'O1-1B'!Q23","v":0},0,0]
[{"$f":"'O1-1B'!Q24","v":0},0,0]
[{"$f":"'O1-1B'!Q25","v":0},0,0]
[{"$f":"'O1-1B'!Q26","v":0},0,0]
[{"$f":"'O1-1B'!Q27","v":0},0,0]
[{"$f":"'O1-1B'!Q28","v":0},0,0]
[{"$f":"'O1-1B'!Q29","v":0},0,0]
[{"$f":"'O1-1B'!Q30","v":0},0,0]
[{"$f":"'O1-1B'!Q31","v":0},0,0]
[{"$f":"'O1-1B'!Q32","v":0},0,0]
[{"$f":"'O1-1B'!Q33","v":0},0,0]
[{"$f":"'O1-1B'!Q34","v":0},0,0]
[{"$f":"'O1-1B'!Q35","v":0},0,0]
[{"$f":"'O1-1B'!Q42","v":0},0,0]
[{"$f":"'O1-1B'!Q43","v":0},0,0]
[{"$f":"'O1-1B'!Q44","v":0},0,0]
[{"$f":"'O1-1B'!Q45","v":0},0,0]
[{"$f":"'O1-1B'!Q46","v":0},0,0]
[{"$f":"'O1-1B'!Q47","v":0},0,0]
[{"$f":"'O1-1B'!Q48","v":0},0,0]
[{"$f":"'O1-1B'!Q49","v":0},0,0]
[{"$f":"'O1-1B'!Q50","v":0},0,0]
[{"$f":"'O1-1B'!R11","v":0},0,0]
[{"$f":"'O1-1B'!R12","v":0},0,0]
[{"$f":"'O1-1B'!R13","v":0},0,0]
[{"$f":"'O1-1B'!R14","v":0},0,0]
[{"$f":"'O1-1B'!R15","v":0},0,0]
[{"$f":"'O1-1B'!R16","v":0},0,0]
[{"$f":"'O1-1B'!R17","v":0},0,0]
[{"$f":"'O1-1B'!R18","v":0},0,0]
[{"$f":"'O1-1B'!R19","v":0},0,0]
[{"$f":"'O1-1B'!R20","v":0},0,0]
[{"$f":"'O1-1B'!R21","v":0},0,0]
[{"$f":"'O1-1B'!R22","v":0},0,0]
[{"$f":"'O1-1B'!R23","v":0},0,0]
[{"$f":"'O1-1B'!R24","v":0},0,0]
[{"$f":"'O1-1B'!R25","v":0},0,0]
[{"$f":"'O1-1B'!R26","v":0},0,0]
[{"$f":"'O1-1B'!R27","v":0},0,0]
[{"$f":"'O1-1B'!R28","v":0},0,0]
[{"$f":"'O1-1B'!R29","v":0},0,0]
[{"$f":"'O1-1B'!R30","v":0},0,0]
[{"$f":"'O1-1B'!R31","v":0},0,0]
[{"$f":"'O1-1B'!R32","v":0},0,0]
[{"$f":"'O1-1B'!R33","v":0},0,0]
[{"$f":"'O1-1B'!R34","v":0},0,0]
[{"$f":"'O1-1B'!R35","v":0},0,0]
[{"$f":"'O1-1B'!S11","v":0},0,0]
[{"$f":"'O1-1B'!S12","v":0},0,0]
[{"$f":"'O1-1B'!S13","v":0},0,0]
[{"$f":"'O1-1B'!S14","v":0},0,0]
[{"$f":"'O1-1B'!S15","v":0},0,0]
[{"$f":"'O1-1B'!S16","v":0},0,0]
[{"$f":"'O1-1B'!S17","v":0},0,0]
[{"$f":"'O1-1B'!S18","v":0},0,0]
[{"$f":"'O1-1B'!S19","v":0},0,0]
[{"$f":"'O1-1B'!S20","v":0},0,0]
[{"$f":"'O1-1B'!S21","v":0},0,0]
[{"$f":"'O1-1B'!S22","v":0},0,0]
[{"$f":"'O1-1B'!S23","v":0},0,0]
[{"$f":"'O1-1B'!S24","v":0},0,0]
[{"$f":"'O1-1B'!S25","v":0},0,0]
[{"$f":"'O1-1B'!S26","v":0},0,0]
[{"$f":"'O1-1B'!S27","v":0},0,{"$f":"A3496*B3496","v":0}]
[{"$f":"'O1-1B'!S28","v":0},0,0]
[{"$f":"'O1-1B'!S29","v":0},0,0]
[{"$f":"'O1-1B'!S30","v":0},0,0]
[{"$f":"'O1-1B'!S31","v":0},0,0]
[{"$f":"'O1-1B'!S32","v":0},0,0]
[{"$f":"'O1-1B'!S33","v":0},0,0]
[{"$f":"'O1-1B'!S34","v":0},0,0]
[{"$f":"'O1-1B'!S35","v":0},0,0]
[{"$f":"'O1-1B'!S42","v":0},0,0]
[{"$f":"'O1-1B'!S43","v":0},0,0]
[{"$f":"'O1-1B'!S44","v":0},0,0]
[{"$f":"'O1-1B'!S45","v":0},0,0]
[{"$f":"'O1-1B'!S46","v":0},0,0]
[{"$f":"'O1-1B'!S47","v":0},0,0]
[{"$f":"'O1-1B'!S48","v":0},0,0]
[{"$f":"'O1-1B'!S49","v":0},0,0]
[{"$f":"'O1-1B'!S50","v":0},0,0]
[{"$f":"'O1-1B'!T11","v":0},0,0]
[{"$f":"'O1-1B'!T12","v":0},0,0]
[{"$f":"'O1-1B'!T13","v":0},0,0]
[{"$f":"'O1-1B'!T14","v":0},0,0]
[{"$f":"'O1-1B'!T15","v":0},0,0]
[{"$f":"'O1-1B'!T16","v":0},0,0]
[{"$f":"'O1-1B'!T17","v":0},0,0]
[{"$f":"'O1-1B'!T18","v":0},0,0]
[{"$f":"'O1-1B'!T19","v":0},0,0]
[{"$f":"'O1-1B'!T20","v":0},0,0]
[{"$f":"'O1-1B'!T21","v":0},0,0]
[{"$f":"'O1-1B'!T22","v":0},0,0]
[{"$f":"'O1-1B'!T23","v":0},0,0]
[{"$f":"'O1-1B'!T24","v":0},0,0]
[{"$f":"'O1-1B'!T25","v":0},0,0]
[{"$f":"'O1-1B'!T26","v":0},0,0]
[{"$f":"'O1-1B'!T27","v":0},0,0]
[{"$f":"'O1-1B'!T28","v":0},0,0]
[{"$f":"'O1-1B'!T29","v":0},0,0]
[{"$f":"'O1-1B'!T30","v":0},0,0]
[{"$f":"'O1-1B'!T31","v":0},0,0]
[{"$f":"'O1-1B'!T32","v":0},0,0]
[{"$f":"'O1-1B'!T33","v":0},0,0]
[{"$f":"'O1-1B'!T34","v":0},0,0]
[{"$f":"'O1-1B'!T35","v":0},0,0]
[{"$f":"'O1-1K'!E10","v":0},0,0]
[{"$f":"'O1-1K'!E11","v":0},0,0]
[{"$f":"'O1-1K'!E12","v":0},0,0]
[{"$f":"'O1-1K'!E13","v":0},0,0]
[{"$f":"'O1-1K'!E14","v":0},0,0]
[{"$f":"'O1-1K'!E15","v":0},0,0]
[{"$f":"'O1-1K'!E16","v":0},0,0]
[{"$f":"'O1-1K'!E17","v":0},0,0]
[{"$f":"'O1-1K'!E18","v":0},0,0]
[{"$f":"'O1-1K'!E19","v":0},0,0]
[{"$f":"'O1-1K'!E20","v":0},0,0]
[{"$f":"'O1-1K'!E21","v":0},0,0]
[{"$f":"'O1-1K'!F10","v":0},0,0]
[{"$f":"'O1-1K'!F11","v":0},0,0]
[{"$f":"'O1-1K'!F12","v":0},0,0]
[{"$f":"'O1-1K'!F13","v":0},0,0]
[{"$f":"'O1-1K'!F14","v":0},0,0]
[{"$f":"'O1-1K'!F15","v":0},0,0]
[{"$f":"'O1-1K'!F16","v":0},0,0]
[{"$f":"'O1-1K'!F17","v":0},0,0]
[{"$f":"'O1-1K'!F18","v":0},0,0]
[{"$f":"'O1-1K'!F19","v":0},0,{"$f":"A3560*B3560","v":0}]
[{"$f":"'O1-1K'!F20","v":0},0,0]
[{"$f":"'O1-1K'!F21","v":0},0,0]
[{"$f":"'O1-1K'!G10","v":0},0,0]
[{"$f":"'O1-1K'!G11","v":0},0,0]
[{"$f":"'O1-1K'!G12","v":0},0,0]
[{"$f":"'O1-1K'!G13","v":0},0,0]
[{"$f":"'O1-1K'!G14","v":0},0,0]
[{"$f":"'O1-1K'!G15","v":0},0,0]
[{"$f":"'O1-1K'!G16","v":0},0,0]
[{"$f":"'O1-1K'!G17","v":0},0,0]
[{"$f":"'O1-1K'!G18","v":0},0,0]
[{"$f":"'O1-1K'!G19","v":0},0,0]
[{"$f":"'O1-1K'!G20","v":0},0,0]
[{"$f":"'O1-1K'!G21","v":0},0,0]
[{"$f":"'O1-1K'!H10","v":0},0,0]
[{"$f":"'O1-1K'!H11","v":0},0,0]
[{"$f":"'O1-1K'!H12","v":0},0,0]
[{"$f":"'O1-1K'!H13","v":0},0,0]
[{"$f":"'O1-1K'!H14","v":0},0,0]
[{"$f":"'O1-1K'!H15","v":0},0,0]
[{"$f":"'O1-1K'!H16","v":0},0,0]
[{"$f":"'O1-1K'!H17","v":0},0,0]
[{"$f":"'O1-1K'!H18","v":0},0,0]
[{"$f":"'O1-1K'!H19","v":0},0,0]
[{"$f":"'O1-1K'!H20","v":0},0,0]
[{"$f":"'O1-1K'!H21","v":0},0,0]
[{"$f":"'O1-1K'!I10","v":0},0,0]
[{"$f":"'O1-1K'!I11","v":0},0,0]
[{"$f":"'O1-1K'!I12","v":0},0,0]
[{"$f":"'O1-1K'!I13","v":0},0,0]
[{"$f":"'O1-1K'!I14","v":0},0,0]
[{"$f":"'O1-1K'!I15","v":0},0,0]
[{"$f":"'O1-1K'!I16","v":0},0,0]
[{"$f":"'O1-1K'!I17","v":0},0,0]
[{"$f":"'O1-1K'!I18","v":0},0,0]
[{"$f":"'O1-1K'!I19","v":0},0,0]
[{"$f":"'O1-1K'!I20","v":0},0,0]
[{"$f":"'O1-1K'!I21","v":0},0,0]
[{"$f":"'O1-1K'!J10","v":0},0,0]
[{"$f":"'O1-1K'!J11","v":0},0,0]
[{"$f":"'O1-1K'!J12","v":0},0,0]
[{"$f":"'O1-1K'!J13","v":0},0,0]
[{"$f":"'O1-1K'!J14","v":0},0,0]
[{"$f":"'O1-1K'!J15","v":0},0,0]
[{"$f":"'O1-1K'!J16","v":0},0,0]
[{"$f":"'O1-1K'!J17","v":0},0,0]
[{"$f":"'O1-1K'!J18","v":0},0,0]
[{"$f":"'O1-1K'!J19","v":0},0,0]
[{"$f":"'O1-1K'!J20","v":0},0,0]
[{"$f":"'O1-1K'!J21","v":0},0,0]
[{"$f":"'O1-2A'!E10","v":0},0,0]
[{"$f":"'O1-2A'!E11","v":0},0,0]
[{"$f":"'O1-2A'!E12","v":0},0,0]
[{"$f":"'O1-2A'!E13","v":0},0,0]
[{"$f":"'O1-2A'!E14","v":0},0,0]
[{"$f":"'O1-2A'!E15","v":0},0,0]
[{"$f":"'O1-2A'!E16","v":0},0,0]
[{"$f":"'O1-2A'!E17","v":0},0,0]
[{"$f":"'O1-2A'!E18","v":0},0,0]
[{"$f":"'O1-2A'!E19","v":0},0,0]
[{"$f":"'O1-2A'!E20","v":0},0,0]
[{"$f":"'O1-2A'!E21","v":0},0,0]
[{"$f":"'O1-2A'!E22","v":0},0,0]
[{"$f":"'O1-2A'!E23","v":0},0,{"$f":"A3624*B3624","v":0}]
[{"$f":"'O1-2A'!E24","v":0},0,0]
[{"$f":"'O1-2A'!E25","v":0},0,0]
[{"$f":"'O1-2A'!E26","v":0},0,0]
[{"$f":"'O1-2A'!E27","v":0},0,0]
[{"$f":"'O1-2A'!E28","v":0},0,0]
[{"$f":"'O1-2A'!E29","v":0},0,0]
[{"$f":"'O1-2A'!E30","v":0},0,0]
[{"$f":"'O1-2A'!E31","v":0},0,0]
[{"$f":"'O1-2A'!E32","v":0},0,0]
[{"$f":"'O1-2A'!E33","v":0},0,0]
[{"$f":"'O1-2A'!E34","v":0},0,0]
[{"$f":"'O1-2A'!E35","v":0},0,0]
[{"$f":"'O1-2A'!E40","v":0},0,0]
[{"$f":"'O1-2A'!E41","v":0},0,0]
[{"$f":"'O1-2A'!E42","v":0},0,0]
[{"$f":"'O1-2A'!E43","v":0},0,0]
[{"$f":"'O1-2A'!E44","v":0},0,0]
[{"$f":"'O1-2A'!E45","v":0},0,0]
[{"$f":"'O1-2A'!E46","v":0},0,0]
[{"$f":"'O1-2A'!E47","v":0},0,0]
[{"$f":"'O1-2A'!E48","v":0},0,0]
[{"$f":"'O1-2A'!E49","v":0},0,0]
[{"$f":"'O1-2A'!E50","v":0},0,0]
[{"$f":"'O1-2A'!E51","v":0},0,0]
[{"$f":"'O1-2A'!F10","v":0},0,0]
[{"$f":"'O1-2A'!F11","v":0},0,0]
[{"$f":"'O1-2A'!F12","v":0},0,0]
[{"$f":"'O1-2A'!F13","v":0},0,0]
[{"$f":"'O1-2A'!F14","v":0},0,0]
[{"$f":"'O1-2A'!F15","v":0},0,0]
[{"$f":"'O1-2A'!F16","v":0},0,0]
[{"$f":"'O1-2A'!F17","v":0},0,0]
[{"$f":"'O1-2A'!F18","v":0},0,0]
[{"$f":"'O1-2A'!F19","v":0},0,0]
[{"$f":"'O1-2A'!F20","v":0},0,0]
[{"$f":"'O1-2A'!F21","v":0},0,0]
[{"$f":"'O1-2A'!F22","v":0},0,0]
[{"$f":"'O1-2A'!F23","v":0},0,0]
[{"$f":"'O1-2A'!F24","v":0},0,0]
[{"$f":"'O1-2A'!F25","v":0},0,0]
[{"$f":"'O1-2A'!F26","v":0},0,0]
[{"$f":"'O1-2A'!F27","v":0},0,0]
[{"$f":"'O1-2A'!F28","v":0},0,0]
[{"$f":"'O1-2A'!F29","v":0},0,0]
[{"$f":"'O1-2A'!F30","v":0},0,0]
[{"$f":"'O1-2A'!F31","v":0},0,0]
[{"$f":"'O1-2A'!F32","v":0},0,0]
[{"$f":"'O1-2A'!F33","v":0},0,0]
[{"$f":"'O1-2A'!F34","v":0},0,0]
[{"$f":"'O1-2A'!F35","v":0},0,0]
[{"$f":"'O1-2A'!G10","v":0},0,0]
[{"$f":"'O1-2A'!G11","v":0},0,0]
[{"$f":"'O1-2A'!G12","v":0},0,0]
[{"$f":"'O1-2A'!G13","v":0},0,0]
[{"$f":"'O1-2A'!G14","v":0},0,0]
[{"$f":"'O1-2A'!G15","v":0},0,0]
[{"$f":"'O1-2A'!G16","v":0},0,0]
[{"$f":"'O1-2A'!G17","v":0},0,0]
[{"$f":"'O1-2A'!G18","v":0},0,0]
[{"$f":"'O1-2A'!G19","v":0},0,0]
[{"$f":"'O1-2A'!G20","v":0},0,0]
[{"$f":"'O1-2A'!G21","v":0},0,0]
[{"$f":"'O1-2A'!G22","v":0},0,0]
[{"$f":"'O1-2A'!G23","v":0},0,{"$f":"A3688*B3688","v":0}]
[{"$f":"'O1-2A'!G24","v":0},0,0]
[{"$f":"'O1-2A'!G25","v":0},0,0]
[{"$f":"'O1-2A'!G26","v":0},0,0]
[{"$f":"'O1-2A'!G27","v":0},0,0]
[{"$f":"'O1-2A'!G28","v":0},0,0]
[{"$f":"'O1-2A'!G29","v":0},0,0]
[{"$f":"'O1-2A'!G30","v":0},0,0]
[{"$f":"'O1-2A'!G31","v":0},0,0]
[{"$f":"'O1-2A'!G32","v":0},0,0]
[{"$f":"'O1-2A'!G33","v":0},0,0]
[{"$f":"'O1-2A'!G34","v":0},0,0]
[{"$f":"'O1-2A'!G35","v":0},0,0]
[{"$f":"'O1-2A'!G40","v":0},0,0]
[{"$f":"'O1-2A'!G41","v":0},0,0]
[{"$f":"'O1-2A'!G42","v":0},0,0]
[{"$f":"'O1-2A'!G43","v":0},0,0]
[{"$f":"'O1-2A'!G44","v":0},0,0]
[{"$f":"'O1-2A'!G45","v":0},0,0]
[{"$f":"'O1-2A'!G46","v":0},0,0]
[{"$f":"'O1-2A'!G47","v":0},0,0]
[{"$f":"'O1-2A'!G48","v":0},0,0]
[{"$f":"'O1-2A'!G49","v":0},0,0]
[{"$f":"'O1-2A'!G50","v":0},0,0]
[{"$f":"'O1-2A'!G51","v":0},0,0]
[{"$f":"'O1-2A'!H10","v":0},0,0]
[{"$f":"'O1-2A'!H11","v":0},0,0]
[{"$f":"'O1-2A'!H12","v":0},0,0]
[{"$f":"'O1-2A'!H13","v":0},0,0]
[{"$f":"'O1-2A'!H14","v":0},0,0]
[{"$f":"'O1-2A'!H15","v":0},0,0]
[{"$f":"'O1-2A'!H16","v":0},0,0]
[{"$f":"'O1-2A'!H17","v":0},0,0]
[{"$f":"'O1-2A'!H18","v":0},0,0]
[{"$f":"'O1-2A'!H19","v":0},0,0]
[{"$f":"'O1-2A'!H20","v":0},0,0]
[{"$f":"'O1-2A'!H21","v":0},0,0]
[{"$f":"'O1-2A'!H22","v":0},0,0]
[{"$f":"'O1-2A'!H23","v":0},0,0]
[{"$f":"'O1-2A'!H24","v":0},0,0]
[{"$f":"'O1-2A'!H25","v":0},0,0]
[{"$f":"'O1-2A'!H26","v":0},0,0]
[{"$f":"'O1-2A'!H27","v":0},0,0]
[{"$f":"'O1-2A'!H28","v":0},0,0]
[{"$f":"'O1-2A'!H29","v":0},0,0]
[{"$f":"'O1-2A'!H30","v":0},0,0]
[{"$f":"'O1-2A'!H31","v":0},0,0]
[{"$f":"'O1-2A'!H32","v":0},0,0]
[{"$f":"'O1-2A'!H33","v":0},0,0]
[{"$f":"'O1-2A'!H34","v":0},0,0]
[{"$f":"'O1-2A'!H35","v":0},0,0]
[{"$f":"'O1-2A'!I10","v":0},0,0]
[{"$f":"'O1-2A'!I11","v":0},0,0]
[{"$f":"'O1-2A'!I12","v":0},0,0]
[{"$f":"'O1-2A'!I13","v":0},0,0]
[{"$f":"'O1-2A'!I14","v":0},0,0]
[{"$f":"'O1-2A'!I15","v":0},0,0]
[{"$f":"'O1-2A'!I16","v":0},0,0]
[{"$f":"'O1-2A'!I17","v":0},0,0]
[{"$f":"'O1-2A'!I18","v":0},0,0]
[{"$f":"'O1-2A'!I19","v":0},0,0]
[{"$f":"'O1-2A'!I20","v":0},0,0]
[{"$f":"'O1-2A'!I21","v":0},0,0]
[{"$f":"'O1-2A'!I22","v":0},0,0]
[{"$f":"'O1-2A'!I23","v":0},0,{"$f":"A3752*B3752","v":0}]
[{"$f":"'O1-2A'!I24","v":0},0,0]
[{"$f":"'O1-2A'!I25","v":0},0,0]
[{"$f":"'O1-2A'!I26","v":0},0,0]
[{"$f":"'O1-2A'!I27","v":0},0,0]
[{"$f":"'O1-2A'!I28","v":0},0,0]
[{"$f":"'O1-2A'!I29","v":0},0,0]
[{"$f":"'O1-2A'!I30","v":0},0,0]
[{"$f":"'O1-2A'!I31","v":0},0,0]
[{"$f":"'O1-2A'!I32","v":0},0,0]
[{"$f":"'O1-2A'!I33","v":0},0,0]
[{"$f":"'O1-2A'!I34","v":0},0,0]
[{"$f":"'O1-2A'!I35","v":0},0,0]
[{"$f":"'O1-2A'!I40","v":0},0,0]
[{"$f":"'O1-2A'!I41","v":0},0,0]
[{"$f":"'O1-2A'!I42","v":0},0,0]
[{"$f":"'O1-2A'!I43","v":0},0,0]
[{"$f":"'O1-2A'!I44","v":0},0,0]
[{"$f":"'O1-2A'!I45","v":0},0,0]
[{"$f":"'O1-2A'!I46","v":0},0,0]
[{"$f":"'O1-2A'!I47","v":0},0,0]
[{"$f":"'O1-2A'!I48","v":0},0,0]
[{"$f":"'O1-2A'!I49","v":0},0,0]
[{"$f":"'O1-2A'!I50","v":0},0,0]
[{"$f":"'O1-2A'!I51","v":0},0,0]
[{"$f":"'O1-2A'!J10","v":0},0,0]
[{"$f":"'O1-2A'!J11","v":0},0,0]
[{"$f":"'O1-2A'!J12","v":0},0,0]
[{"$f":"'O1-2A'!J13","v":0},0,0]
[{"$f":"'O1-2A'!J14","v":0},0,0]
[{"$f":"'O1-2A'!J15","v":0},0,0]
[{"$f":"'O1-2A'!J16","v":0},0,0]
[{"$f":"'O1-2A'!J17","v":0},0,0]
[{"$f":"'O1-2A'!J18","v":0},0,0]
[{"$f":"'O1-2A'!J19","v":0},0,0]
[{"$f":"'O1-2A'!J20","v":0},0,0]
[{"$f":"'O1-2A'!J21","v":0},0,0]
[{"$f":"'O1-2A'!J22","v":0},0,0]
[{"$f":"'O1-2A'!J23","v":0},0,0]
[{"$f":"'O1-2A'!J24","v":0},0,0]
[{"$f":"'O1-2A'!J25","v":0},0,0]
[{"$f":"'O1-2A'!J26","v":0},0,0]
[{"$f":"'O1-2A'!J27","v":0},0,0]
[{"$f":"'O1-2A'!J28","v":0},0,0]
[{"$f":"'O1-2A'!J29","v":0},0,0]
[{"$f":"'O1-2A'!J30","v":0},0,0]
[{"$f":"'O1-2A'!J31","v":0},0,0]
[{"$f":"'O1-2A'!J32","v":0},0,0]
[{"$f":"'O1-2A'!J33","v":0},0,0]
[{"$f":"'O1-2A'!J34","v":0},0,0]
[{"$f":"'O1-2A'!J35","v":0},0,0]
[{"$f":"'O1-2A'!K10","v":0},0,0]
[{"$f":"'O1-2A'!K11","v":0},0,0]
[{"$f":"'O1-2A'!K12","v":0},0,0]
[{"$f":"'O1-2A'!K13","v":0},0,0]
[{"$f":"'O1-2A'!K14","v":0},0,0]
[{"$f":"'O1-2A'!K15","v":0},0,0]
[{"$f":"'O1-2A'!K16","v":0},0,0]
[{"$f":"'O1-2A'!K17","v":0},0,0]
[{"$f":"'O1-2A'!K18","v":0},0,0]
[{"$f":"'O1-2A'!K19","v":0},0,0]
[{"$f":"'O1-2A'!K20","v":0},0,0]
[{"$f":"'O1-2A'!K21","v":0},0,0]
[{"$f":"'O1-2A'!K22","v":0},0,0]
[{"$f":"'O1-2A'!K23","v":0},0,{"$f":"A3816*B3816","v":0}]
[{"$f":"'O1-2A'!K24","v":0},0,0]
[{"$f":"'O1-2A'!K25","v":0},0,0]
[{"$f":"'O1-2A'!K26","v":0},0,0]
[{"$f":"'O1-2A'!K27","v":0},0,0]
[{"$f":"'O1-2A'!K28","v":0},0,0]
[{"$f":"'O1-2A'!K29","v":0},0,0]
[{"$f":"'O1-2A'!K30","v":0},0,0]
[{"$f":"'O1-2A'!K31","v":0},0,0]
[{"$f":"'O1-2A'!K32","v":0},0,0]
[{"$f":"'O1-2A'!K33","v":0},0,0]
[{"$f":"'O1-2A'!K34","v":0},0,0]
[{"$f":"'O1-2A'!K35","v":0},0,0]
[{"$f":"'O1-2A'!K40","v":0},0,0]
[{"$f":"'O1-2A'!K41","v":0},0,0]
[{"$f":"'O1-2A'!K42","v":0},0,0]
[{"$f":"'O1-2A'!K43","v":0},0,0]
[{"$f":"'O1-2A'!K44","v":0},0,0]
[{"$f":"'O1-2A'!K45","v":0},0,0]
[{"$f":"'O1-2A'!K46","v":0},0,0]
[{"$f":"'O1-2A'!K47","v":0},0,0]
[{"$f":"'O1-2A'!K48","v":0},0,0]
[{"$f":"'O1-2A'!K49","v":0},0,0]
[{"$f":"'O1-2A'!K50","v":0},0,0]
[{"$f":"'O1-2A'!K51","v":0},0,0]
[{"$f":"'O1-2A'!L10","v":0},0,0]
[{"$f":"'O1-2A'!L11","v":0},0,0]
[{"$f":"'O1-2A'!L12","v":0},0,0]
[{"$f":"'O1-2A'!L13","v":0},0,0]
[{"$f":"'O1-2A'!L14","v":0},0,0]
[{"$f":"'O1-2A'!L15","v":0},0,0]
[{"$f":"'O1-2A'!L16","v":0},0,0]
[{"$f":"'O1-2A'!L17","v":0},0,0]
[{"$f":"'O1-2A'!L18","v":0},0,0]
[{"$f":"'O1-2A'!L19","v":0},0,0]
[{"$f":"'O1-2A'!L20","v":0},0,0]
[{"$f":"'O1-2A'!L21","v":0},0,0]
[{"$f":"'O1-2A'!L22","v":0},0,0]
[{"$f":"'O1-2A'!L23","v":0},0,0]
[{"$f":"'O1-2A'!L24","v":0},0,0]
[{"$f":"'O1-2A'!L25","v":0},0,0]
[{"$f":"'O1-2A'!L26","v":0},0,0]
[{"$f":"'O1-2A'!L27","v":0},0,0]
[{"$f":"'O1-2A'!L28","v":0},0,0]
[{"$f":"'O1-2A'!L29","v":0},0,0]
[{"$f":"'O1-2A'!L30","v":0},0,0]
[{"$f":"'O1-2A'!L31","v":0},0,0]
[{"$f":"'O1-2A'!L32","v":0},0,0]
[{"$f":"'O1-2A'!L33","v":0},0,0]
[{"$f":"'O1-2A'!L34","v":0},0,0]
[{"$f":"'O1-2A'!L35","v":0},0,0]
[{"$f":"'O1-2A'!M10","v":0},0,0]
[{"$f":"'O1-2A'!M11","v":0},0,0]
[{"$f":"'O1-2A'!M12","v":0},0,0]
[{"$f":"'O1-2A'!M13","v":0},0,0]
[{"$f":"'O1-2A'!M14","v":0},0,0]
[{"$f":"'O1-2A'!M15","v":0},0,0]
[{"$f":"'O1-2A'!M16","v":0},0,0]
[{"$f":"'O1-2A'!M17","v":0},0,0]
[{"$f":"'O1-2A'!M18","v":0},0,0]
[{"$f":"'O1-2A'!M19","v":0},0,0]
[{"$f":"'O1-2A'!M20","v":0},0,0]
[{"$f":"'O1-2A'!M21","v":0},0,0]
[{"$f":"'O1-2A'!M22","v":0},0,0]
[{"$f":"'O1-2A'!M23","v":0},0,{"$f":"A3880*B3880","v":0}]
[{"$f":"'O1-2A'!M24","v":0},0,0]
[{"$f":"'O1-2A'!M25","v":0},0,0]
[{"$f":"'O1-2A'!M26","v":0},0,0]
[{"$f":"'O1-2A'!M27","v":0},0,0]
[{"$f":"'O1-2A'!M28","v":0},0,0]
[{"$f":"'O1-2A'!M29","v":0},0,0]
[{"$f":"'O1-2A'!M30","v":0},0,0]
[{"$f":"'O1-2A'!M31","v":0},0,0]
[{"$f":"'O1-2A'!M32","v":0},0,0]
[{"$f":"'O1-2A'!M33","v":0},0,0]
[{"$f":"'O1-2A'!M34","v":0},0,0]
[{"$f":"'O1-2A'!M35","v":0},0,0]
[{"$f":"'O1-2A'!N10","v":0},0,0]
[{"$f":"'O1-2A'!N11","v":0},0,0]
[{"$f":"'O1-2A'!N12","v":0},0,0]
[{"$f":"'O1-2A'!N13","v":0},0,0]
[{"$f":"'O1-2A'!N14","v":0},0,0]
[{"$f":"'O1-2A'!N15","v":0},0,0]
[{"$f":"'O1-2A'!N16","v":0},0,0]
[{"$f":"'O1-2A'!N17","v":0},0,0]
[{"$f":"'O1-2A'!N18","v":0},0,0]
[{"$f":"'O1-2A'!N19","v":0},0,0]
[{"$f":"'O1-2A'!N20","v":0},0,0]
[{"$f":"'O1-2A'!N21","v":0},0,0]
[{"$f":"'O1-2A'!N22","v":0},0,0]
[{"$f":"'O1-2A'!N23","v":0},0,0]
[{"$f":"'O1-2A'!N24","v":0},0,0]
[{"$f":"'O1-2A'!N25","v":0},0,0]
[{"$f":"'O1-2A'!N26","v":0},0,0]
[{"$f":"'O1-2A'!N27","v":0},0,0]
[{"$f":"'O1-2A'!N28","v":0},0,0]
[{"$f":"'O1-2A'!N29","v":0},0,0]
[{"$f":"'O1-2A'!N30","v":0},0,0]
[{"$f":"'O1-2A'!N31","v":0},0,0]
[{"$f":"'O1-2A'!N32","v":0},0,0]
[{"$f":"'O1-2A'!N33","v":0},0,0]
[{"$f":"'O1-2A'!N34","v":0},0,0]
[{"$f":"'O1-2A'!N35","v":0},0,0]
[{"$f":"'O1-2A'!O10","v":0},0,0]
[{"$f":"'O1-2A'!O11","v":0},0,0]
[{"$f":"'O1-2A'!O12","v":0},0,0]
[{"$f":"'O1-2A'!O13","v":0},0,0]
[{"$f":"'O1-2A'!O14","v":0},0,0]
[{"$f":"'O1-2A'!O15","v":0},0,0]
[{"$f":"'O1-2A'!O16","v":0},0,0]
[{"$f":"'O1-2A'!O17","v":0},0,0]
[{"$f":"'O1-2A'!O18","v":0},0,0]
[{"$f":"'O1-2A'!O19","v":0},0,0]
[{"$f":"'O1-2A'!O20","v":0},0,0]
[{"$f":"'O1-2A'!O21","v":0},0,0]
[{"$f":"'O1-2A'!O22","v":0},0,0]
[{"$f":"'O1-2A'!O23","v":0},0,0]
[{"$f":"'O1-2A'!O24","v":0},0,0]
[{"$f":"'O1-2A'!O25","v":0},0,0]
[{"$f":"'O1-2A'!O26","v":0},0,0]
[{"$f":"'O1-2A'!O27","v":0},0,0]
[{"$f":"'O1-2A'!O28","v":0},0,0]
[{"$f":"'O1-2A'!O29","v":0},0,0]
[{"$f":"'O1-2A'!O30","v":0},0,0]
[{"$f":"'O1-2A'!O31","v":0},0,0]
[{"$f":"'O1-2A'!O32","v":0},0,0]
[{"$f":"'O1-2A'!O33","v":0},0,0]
[{"$f":"'O1-2A'!O34","v":0},0,0]
[{"$f":"'O1-2A'!O35","v":0},0,{"$f":"A3944*B3944","v":0}]
[{"$f":"'O1-2A'!P10","v":0},0,0]
[{"$f":"'O1-2A'!P11","v":0},0,0]
[{"$f":"'O1-2A'!P12","v":0},0,0]
[{"$f":"'O1-2A'!P13","v":0},0,0]
[{"$f":"'O1-2A'!P14","v":0},0,0]
[{"$f":"'O1-2A'!P15","v":0},0,0]
[{"$f":"'O1-2A'!P16","v":0},0,0]
[{"$f":"'O1-2A'!P17","v":0},0,0]
[{"$f":"'O1-2A'!P18","v":0},0,0]
[{"$f":"'O1-2A'!P19","v":0},0,0]
[{"$f":"'O1-2A'!P20","v":0},0,0]
[{"$f":"'O1-2A'!P21","v":0},0,0]
[{"$f":"'O1-2A'!P22","v":0},0,0]
[{"$f":"'O1-2A'!P23","v":0},0,0]
[{"$f":"'O1-2A'!P24","v":0},0,0]
[{"$f":"'O1-2A'!P25","v":0},0,0]
[{"$f":"'O1-2A'!P26","v":0},0,0]
[{"$f":"'O1-2A'!P27","v":0},0,0]
[{"$f":"'O1-2A'!P28","v":0},0,0]
[{"$f":"'O1-2A'!P29","v":0},0,0]
[{"$f":"'O1-2A'!P30","v":0},0,0]
[{"$f":"'O1-2A'!P31","v":0},0,0]
[{"$f":"'O1-2A'!P32","v":0},0,0]
[{"$f":"'O1-2A'!P33","v":0},0,0]
[{"$f":"'O1-2A'!P34","v":0},0,0]
[{"$f":"'O1-2A'!P35","v":0},0,0]
[{"$f":"'O1-2B'!E11","v":0},0,0]
[{"$f":"'O1-2B'!E12","v":0},0,0]
[{"$f":"'O1-2B'!E13","v":0},0,0]
[{"$f":"'O1-2B'!E14","v":0},0,0]
[{"$f":"'O1-2B'!E15","v":0},0,0]
[{"$f":"'O1-2B'!E16","v":0},0,0]
[{"$f":"'O1-2B'!E17","v":0},0,0]
[{"$f":"'O1-2B'!E18","v":0},0,0]
[{"$f":"'O1-2B'!E19","v":0},0,0]
[{"$f":"'O1-2B'!E20","v":0},0,0]
[{"$f":"'O1-2B'!E21","v":0},0,0]
[{"$f":"'O1-2B'!E22","v":0},0,0]
[{"$f":"'O1-2B'!E23","v":0},0,0]
[{"$f":"'O1-2B'!E24","v":0},0,0]
[{"$f":"'O1-2B'!E25","v":0},0,0]
[{"$f":"'O1-2B'!E26","v":0},0,0]
[{"$f":"'O1-2B'!E27","v":0},0,0]
[{"$f":"'O1-2B'!E28","v":0},0,0]
[{"$f":"'O1-2B'!E29","v":0},0,0]
[{"$f":"'O1-2B'!E30","v":0},0,0]
[{"$f":"'O1-2B'!E31","v":0},0,0]
[{"$f":"'O1-2B'!E32","v":0},0,0]
[{"$f":"'O1-2B'!E33","v":0},0,0]
[{"$f":"'O1-2B'!E34","v":0},0,0]
[{"$f":"'O1-2B'!E35","v":0},0,0]
[{"$f":"'O1-2B'!E42","v":0},0,0]
[{"$f":"'O1-2B'!E43","v":0},0,0]
[{"$f":"'O1-2B'!E44","v":0},0,0]
[{"$f":"'O1-2B'!E45","v":0},0,0]
[{"$f":"'O1-2B'!E46","v":0},0,0]
[{"$f":"'O1-2B'!E47","v":0},0,0]
[{"$f":"'O1-2B'!E48","v":0},0,0]
[{"$f":"'O1-2B'!E49","v":0},0,0]
[{"$f":"'O1-2B'!E50","v":0},0,0]
[{"$f":"'O1-2B'!F11","v":0},0,0]
[{"$f":"'O1-2B'!F12","v":0},0,0]
[{"$f":"'O1-2B'!F13","v":0},0,0]
[{"$f":"'O1-2B'!F14","v":0},0,{"$f":"A4008*B4008","v":0}]
[{"$f":"'O1-2B'!F15","v":0},0,0]
[{"$f":"'O1-2B'!F16","v":0},0,0]
[{"$f":"'O1-2B'!F17","v":0},0,0]
[{"$f":"'O1-2B'!F18","v":0},0,0]
[{"$f":"'O1-2B'!F19","v":0},0,0]
[{"$f":"'O1-2B'!F20","v":0},0,0]
[{"$f":"'O1-2B'!F21","v":0},0,0]
[{"$f":"'O1-2B'!F22","v":0},0,0]
[{"$f":"'O1-2B'!F23","v":0},0,0]
[{"$f":"'O1-2B'!F24","v":0},0,0]
[{"$f":"'O1-2B'!F25","v":0},0,0]
[{"$f":"'O1-2B'!F26","v":0},0,0]
[{"$f":"'O1-2B'!F27","v":0},0,0]
[{"$f":"'O1-2B'!F28","v":0},0,0]
[{"$f":"'O1-2B'!F29","v":0},0,0]
[{"$f":"'O1-2B'!F30","v":0},0,0]
[{"$f":"'O1-2B'!F31","v":0},0,0]
[{"$f":"'O1-2B'!F32","v":0},0,0]
[{"$f":"'O1-2B'!F33","v":0},0,0]
[{"$f":"'O1-2B'!F34","v":0},0,0]
[{"$f":"'O1-2B'!F35","v":0},0,0]
[{"$f":"'O1-2B'!G11","v":0},0,0]
[{"$f":"'O1-2B'!G12","v":0},0,0]
[{"$f":"'O1-2B'!G13","v":0},0,0]
[{"$f":"'O1-2B'!G14","v":0},0,0]
[{"$f":"'O1-2B'!G15","v":0},0,0]
[{"$f":"'O1-2B'!G16","v":0},0,0]
[{"$f":"'O1-2B'!G17","v":0},0,0]
[{"$f":"'O1-2B'!G18","v":0},0,0]
[{"$f":"'O1-2B'!G19","v":0},0,0]
[{"$f":"'O1-2B'!G20","v":0},0,0]
[{"$f":"'O1-2B'!G21","v":0},0,0]
[{"$f":"'O1-2B'!G22","v":0},0,0]
[{"$f":"'O1-2B'!G23","v":0},0,0]
[{"$f":"'O1-2B'!G24","v":0},0,0]
[{"$f":"'O1-2B'!G25","v":0},0,0]
[{"$f":"'O1-2B'!G26","v":0},0,0]
[{"$f":"'O1-2B'!G27","v":0},0,0]
[{"$f":"'O1-2B'!G28","v":0},0,0]
[{"$f":"'O1-2B'!G29","v":0},0,0]
[{"$f":"'O1-2B'!G30","v":0},0,0]
[{"$f":"'O1-2B'!G31","v":0},0,0]
[{"$f":"'O1-2B'!G32","v":0},0,0]
[{"$f":"'O1-2B'!G33","v":0},0,0]
[{"$f":"'O1-2B'!G34","v":0},0,0]
[{"$f":"'O1-2B'!G35","v":0},0,0]
[{"$f":"'O1-2B'!G42","v":0},0,0]
[{"$f":"'O1-2B'!G43","v":0},0,0]
[{"$f":"'O1-2B'!G44","v":0},0,0]
[{"$f":"'O1-2B'!G45","v":0},0,0]
[{"$f":"'O1-2B'!G46","v":0},0,0]
[{"$f":"'O1-2B'!G47","v":0},0,0]
[{"$f":"'O1-2B'!G48","v":0},0,0]
[{"$f":"'O1-2B'!G49","v":0},0,0]
[{"$f":"'O1-2B'!G50","v":0},0,0]
[{"$f":"'O1-2B'!H11","v":0},0,0]
[{"$f":"'O1-2B'!H12","v":0},0,0]
[{"$f":"'O1-2B'!H13","v":0},0,0]
[{"$f":"'O1-2B'!H14","v":0},0,0]
[{"$f":"'O1-2B'!H15","v":0},0,0]
[{"$f":"'O1-2B'!H16","v":0},0,0]
[{"$f":"'O1-2B'!H17","v":0},0,0]
[{"$f":"'O1-2B'!H18","v":0},0,0]
[{"$f":"'O1-2B'!H19","v":0},0,{"$f":"A4072*B4072","v":0}]
[{"$f":"'O1-2B'!H20","v":0},0,0]
[{"$f":"'O1-2B'!H21","v":0},0,0]
[{"$f":"'O1-2B'!H22","v":0},0,0]
[{"$f":"'O1-2B'!H23","v":0},0,0]
[{"$f":"'O1-2B'!H24","v":0},0,0]
[{"$f":"'O1-2B'!H25","v":0},0,0]
[{"$f":"'O1-2B'!H26","v":0},0,0]
[{"$f":"'O1-2B'!H27","v":0},0,0]
[{"$f":"'O1-2B'!H28","v":0},0,0]
[{"$f":"'O1-2B'!H29","v":0},0,0]
[{"$f":"'O1-2B'!H30","v":0},0,0]
[{"$f":"'O1-2B'!H31","v":0},0,0]
[{"$f":"'O1-2B'!H32","v":0},0,0]
[{"$f":"'O1-2B'!H33","v":0},0,0]
[{"$f":"'O1-2B'!H34","v":0},0,0]
[{"$f":"'O1-2B'!H35","v":0},0,0]
[{"$f":"'O1-2B'!I11","v":0},0,0]
[{"$f":"'O1-2B'!I12","v":0},0,0]
[{"$f":"'O1-2B'!I13","v":0},0,0]
[{"$f":"'O1-2B'!I14","v":0},0,0]
[{"$f":"'O1-2B'!I15","v":0},0,0]
[{"$f":"'O1-2B'!I16","v":0},0,0]
[{"$f":"'O1-2B'!I17","v":0},0,0]
[{"$f":"'O1-2B'!I18","v":0},0,0]
[{"$f":"'O1-2B'!I19","v":0},0,0]
[{"$f":"'O1-2B'!I20","v":0},0,0]
[{"$f":"'O1-2B'!I21","v":0},0,0]
[{"$f":"'O1-2B'!I22","v":0},0,0]
[{"$f":"'O1-2B'!I23","v":0},0,0]
[{"$f":"'O1-2B'!I24","v":0},0,0]
[{"$f":"'O1-2B'!I25","v":0},0,0]
[{"$f":"'O1-2B'!I26","v":0},0,0]
[{"$f":"'O1-2B'!I27","v":0},0,0]
[{"$f":"'O1-2B'!I28","v":0},0,0]
[{"$f":"'O1-2B'!I29","v":0},0,0]
[{"$f":"'O1-2B'!I30","v":0},0,0]
[{"$f":"'O1-2B'!I31","v":0},0,0]
[{"$f":"'O1-2B'!I32","v":0},0,0]
[{"$f":"'O1-2B'!I33","v":0},0,0]
[{"$f":"'O1-2B'!I34","v":0},0,0]
[{"$f":"'O1-2B'!I35","v":0},0,0]
[{"$f":"'O1-2B'!I42","v":0},0,0]
[{"$f":"'O1-2B'!I43","v":0},0,0]
[{"$f":"'O1-2B'!I44","v":0},0,0]
[{"$f":"'O1-2B'!I45","v":0},0,0]
[{"$f":"'O1-2B'!I46","v":0},0,0]
[{"$f":"'O1-2B'!I47","v":0},0,0]
[{"$f":"'O1-2B'!I48","v":0},0,0]
[{"$f":"'O1-2B'!I49","v":0},0,0]
[{"$f":"'O1-2B'!I50","v":0},0,0]
[{"$f":"'O1-2B'!J11","v":0},0,0]
[{"$f":"'O1-2B'!J12","v":0},0,0]
[{"$f":"'O1-2B'!J13","v":0},0,0]
[{"$f":"'O1-2B'!J14","v":0},0,0]
[{"$f":"'O1-2B'!J15","v":0},0,0]
[{"$f":"'O1-2B'!J16","v":0},0,0]
[{"$f":"'O1-2B'!J17","v":0},0,0]
[{"$f":"'O1-2B'!J18","v":0},0,0]
[{"$f":"'O1-2B'!J19","v":0},0,0]
[{"$f":"'O1-2B'!J20","v":0},0,0]
[{"$f":"'O1-2B'!J21","v":0},0,0]
[{"$f":"'O1-2B'!J22","v":0},0,0]
[{"$f":"'O1-2B'!J23","v":0},0,0]
[{"$f":"'O1-2B'!J24","v":0},0,{"$f":"A4136*B4136","v":0}]
[{"$f":"'O1-2B'!J25","v":0},0,0]
[{"$f":"'O1-2B'!J26","v":0},0,0]
[{"$f":"'O1-2B'!J27","v":0},0,0]
[{"$f":"'O1-2B'!J28","v":0},0,0]
[{"$f":"'O1-2B'!J29","v":0},0,0]
[{"$f":"'O1-2B'!J30","v":0},0,0]
[{"$f":"'O1-2B'!J31","v":0},0,0]
[{"$f":"'O1-2B'!J32","v":0},0,0]
[{"$f":"'O1-2B'!J33","v":0},0,0]
[{"$f":"'O1-2B'!J34","v":0},0,0]
[{"$f":"'O1-2B'!J35","v":0},0,0]
[{"$f":"'O1-2B'!K11","v":0},0,0]
[{"$f":"'O1-2B'!K12","v":0},0,0]
[{"$f":"'O1-2B'!K13","v":0},0,0]
[{"$f":"'O1-2B'!K14","v":0},0,0]
[{"$f":"'O1-2B'!K15","v":0},0,0]
[{"$f":"'O1-2B'!K16","v":0},0,0]
[{"$f":"'O1-2B'!K17","v":0},0,0]
[{"$f":"'O1-2B'!K18","v":0},0,0]
[{"$f":"'O1-2B'!K19","v":0},0,0]
[{"$f":"'O1-2B'!K20","v":0},0,0]
[{"$f":"'O1-2B'!K21","v":0},0,0]
[{"$f":"'O1-2B'!K22","v":0},0,0]
[{"$f":"'O1-2B'!K23","v":0},0,0]
[{"$f":"'O1-2B'!K24","v":0},0,0]
[{"$f":"'O1-2B'!K25","v":0},0,0]
[{"$f":"'O1-2B'!K26","v":0},0,0]
[{"$f":"'O1-2B'!K27","v":0},0,0]
[{"$f":"'O1-2B'!K28","v":0},0,0]
[{"$f":"'O1-2B'!K29","v":0},0,0]
[{"$f":"'O1-2B'!K30","v":0},0,0]
[{"$f":"'O1-2B'!K31","v":0},0,0]
[{"$f":"'O1-2B'!K32","v":0},0,0]
[{"$f":"'O1-2B'!K33","v":0},0,0]
[{"$f":"'O1-2B'!K34","v":0},0,0]
[{"$f":"'O1-2B'!K35","v":0},0,0]
[{"$f":"'O1-2B'!K42","v":0},0,0]
[{"$f":"'O1-2B'!K43","v":0},0,0]
[{"$f":"'O1-2B'!K44","v":0},0,0]
[{"$f":"'O1-2B'!K45","v":0},0,0]
[{"$f":"'O1-2B'!K46","v":0},0,0]
[{"$f":"'O1-2B'!K47","v":0},0,0]
[{"$f":"'O1-2B'!K48","v":0},0,0]
[{"$f":"'O1-2B'!K49","v":0},0,0]
[{"$f":"'O1-2B'!K50","v":0},0,0]
[{"$f":"'O1-2B'!L11","v":0},0,0]
[{"$f":"'O1-2B'!L12","v":0},0,0]
[{"$f":"'O1-2B'!L13","v":0},0,0]
[{"$f":"'O1-2B'!L14","v":0},0,0]
[{"$f":"'O1-2B'!L15","v":0},0,0]
[{"$f":"'O1-2B'!L16","v":0},0,0]
[{"$f":"'O1-2B'!L17","v":0},0,0]
[{"$f":"'O1-2B'!L18","v":0},0,0]
[{"$f":"'O1-2B'!L19","v":0},0,0]
[{"$f":"'O1-2B'!L20","v":0},0,0]
[{"$f":"'O1-2B'!L21","v":0},0,0]
[{"$f":"'O1-2B'!L22","v":0},0,0]
[{"$f":"'O1-2B'!L23","v":0},0,0]
[{"$f":"'O1-2B'!L24","v":0},0,0]
[{"$f":"'O1-2B'!L25","v":0},0,0]
[{"$f":"'O1-2B'!L26","v":0},0,0]
[{"$f":"'O1-2B'!L27","v":0},0,0]
[{"$f":"'O1-2B'!L28","v":0},0,0]
[{"$f":"'O1-2B'!L29","v":0},0,{"$f":"A4200*B4200","v":0}]
[{"$f":"'O1-2B'!L30","v":0},0,0]
[{"$f":"'O1-2B'!L31","v":0},0,0]
[{"$f":"'O1-2B'!L32","v":0},0,0]
[{"$f":"'O1-2B'!L33","v":0},0,0]
[{"$f":"'O1-2B'!L34","v":0},0,0]
[{"$f":"'O1-2B'!L35","v":0},0,0]
[{"$f":"'O1-2B'!M11","v":0},0,0]
[{"$f":"'O1-2B'!M12","v":0},0,0]
[{"$f":"'O1-2B'!M13","v":0},0,0]
[{"$f":"'O1-2B'!M14","v":0},0,0]
[{"$f":"'O1-2B'!M15","v":0},0,0]
[{"$f":"'O1-2B'!M16","v":0},0,0]
[{"$f":"'O1-2B'!M17","v":0},0,0]
[{"$f":"'O1-2B'!M18","v":0},0,0]
[{"$f":"'O1-2B'!M19","v":0},0,0]
[{"$f":"'O1-2B'!M20","v":0},0,0]
[{"$f":"'O1-2B'!M21","v":0},0,0]
[{"$f":"'O1-2B'!M22","v":0},0,0]
[{"$f":"'O1-2B'!M23","v":0},0,0]
[{"$f":"'O1-2B'!M24","v":0},0,0]
[{"$f":"'O1-2B'!M25","v":0},0,0]
[{"$f":"'O1-2B'!M26","v":0},0,0]
[{"$f":"'O1-2B'!M27","v":0},0,0]
[{"$f":"'O1-2B'!M28","v":0},0,0]
[{"$f":"'O1-2B'!M29","v":0},0,0]
[{"$f":"'O1-2B'!M30","v":0},0,0]
[{"$f":"'O1-2B'!M31","v":0},0,0]
[{"$f":"'O1-2B'!M32","v":0},0,0]
[{"$f":"'O1-2B'!M33","v":0},0,0]
[{"$f":"'O1-2B'!M34","v":0},0,0]
[{"$f":"'O1-2B'!M35","v":0},0,0]
[{"$f":"'O1-2B'!M42","v":0},0,0]
[{"$f":"'O1-2B'!M43","v":0},0,0]
[{"$f":"'O1-2B'!M44","v":0},0,0]
[{"$f":"'O1-2B'!M45","v":0},0,0]
[{"$f":"'O1-2B'!M46","v":0},0,0]
[{"$f":"'O1-2B'!M47","v":0},0,0]
[{"$f":"'O1-2B'!M48","v":0},0,0]
[{"$f":"'O1-2B'!M49","v":0},0,0]
[{"$f":"'O1-2B'!M50","v":0},0,0]
[{"$f":"'O1-2B'!N11","v":0},0,0]
[{"$f":"'O1-2B'!N12","v":0},0,0]
[{"$f":"'O1-2B'!N13","v":0},0,0]
[{"$f":"'O1-2B'!N14","v":0},0,0]
[{"$f":"'O1-2B'!N15","v":0},0,0]
[{"$f":"'O1-2B'!N16","v":0},0,0]
[{"$f":"'O1-2B'!N17","v":0},0,0]
[{"$f":"'O1-2B'!N18","v":0},0,0]
[{"$f":"'O1-2B'!N19","v":0},0,0]
[{"$f":"'O1-2B'!N20","v":0},0,0]
[{"$f":"'O1-2B'!N21","v":0},0,0]
[{"$f":"'O1-2B'!N22","v":0},0,0]
[{"$f":"'O1-2B'!N23","v":0},0,0]
[{"$f":"'O1-2B'!N24","v":0},0,0]
[{"$f":"'O1-2B'!N25","v":0},0,0]
[{"$f":"'O1-2B'!N26","v":0},0,0]
[{"$f":"'O1-2B'!N27","v":0},0,0]
[{"$f":"'O1-2B'!N28","v":0},0,0]
[{"$f":"'O1-2B'!N29","v":0},0,0]
[{"$f":"'O1-2B'!N30","v":0},0,0]
[{"$f":"'O1-2B'!N31","v":0},0,0]
[{"$f":"'O1-2B'!N32","v":0},0,0]
[{"$f":"'O1-2B'!N33","v":0},0,0]
[{"$f":"'O1-2B'!N34","v":0},0,{"$f":"A4264*B4264","v":0}]
[{"$f":"'O1-2B'!N35","v":0},0,0]
[{"$f":"'O1-2B'!O11","v":0},0,0]
[{"$f":"'O1-2B'!O12","v":0},0,0]
[{"$f":"'O1-2B'!O13","v":0},0,0]
[{"$f":"'O1-2B'!O14","v":0},0,0]
[{"$f":"'O1-2B'!O15","v":0},0,0]
[{"$f":"'O1-2B'!O16","v":0},0,0]
[{"$f":"'O1-2B'!O17","v":0},0,0]
[{"$f":"'O1-2B'!O18","v":0},0,0]
[{"$f":"'O1-2B'!O19","v":0},0,0]
[{"$f":"'O1-2B'!O20","v":0},0,0]
[{"$f":"'O1-2B'!O21","v":0},0,0]
[{"$f":"'O1-2B'!O22","v":0},0,0]
[{"$f":"'O1-2B'!O23","v":0},0,0]
[{"$f":"'O1-2B'!O24","v":0},0,0]
[{"$f":"'O1-2B'!O25","v":0},0,0]
[{"$f":"'O1-2B'!O26","v":0},0,0]
[{"$f":"'O1-2B'!O27","v":0},0,0]
[{"$f":"'O1-2B'!O28","v":0},0,0]
[{"$f":"'O1-2B'!O29","v":0},0,0]
[{"$f":"'O1-2B'!O30","v":0},0,0]
[{"$f":"'O1-2B'!O31","v":0},0,0]
[{"$f":"'O1-2B'!O32","v":0},0,0]
[{"$f":"'O1-2B'!O33","v":0},0,0]
[{"$f":"'O1-2B'!O34","v":0},0,0]
[{"$f":"'O1-2B'!O35","v":0},0,0]
[{"$f":"'O1-2B'!O42","v":0},0,0]
[{"$f":"'O1-2B'!O43","v":0},0,0]
[{"$f":"'O1-2B'!O44","v":0},0,0]
[{"$f":"'O1-2B'!O45","v":0},0,0]
[{"$f":"'O1-2B'!O46","v":0},0,0]
[{"$f":"'O1-2B'!O47","v":0},0,0]
[{"$f":"'O1-2B'!O48","v":0},0,0]
[{"$f":"'O1-2B'!O49","v":0},0,0]
[{"$f":"'O1-2B'!O50","v":0},0,0]
[{"$f":"'O1-2B'!P11","v":0},0,0]
[{"$f":"'O1-2B'!P12","v":0},0,0]
[{"$f":"'O1-2B'!P13","v":0},0,0]
[{"$f":"'O1-2B'!P14","v":0},0,0]
[{"$f":"'O1-2B'!P15","v":0},0,0]
[{"$f":"'O1-2B'!P16","v":0},0,0]
[{"$f":"'O1-2B'!P17","v":0},0,0]
[{"$f":"'O1-2B'!P18","v":0},0,0]
[{"$f":"'O1-2B'!P19","v":0},0,0]
[{"$f":"'O1-2B'!P20","v":0},0,0]
[{"$f":"'O1-2B'!P21","v":0},0,0]
[{"$f":"'O1-2B'!P22","v":0},0,0]
[{"$f":"'O1-2B'!P23","v":0},0,0]
[{"$f":"'O1-2B'!P24","v":0},0,0]
[{"$f":"'O1-2B'!P25","v":0},0,0]
[{"$f":"'O1-2B'!P26","v":0},0,0]
[{"$f":"'O1-2B'!P27","v":0},0,0]
[{"$f":"'O1-2B'!P28","v":0},0,0]
[{"$f":"'O1-2B'!P29","v":0},0,0]
[{"$f":"'O1-2B'!P30","v":0},0,0]
[{"$f":"'O1-2B'!P31","v":0},0,0]
[{"$f":"'O1-2B'!P32","v":0},0,0]
[{"$f":"'O1-2B'!P33","v":0},0,0]
[{"$f":"'O1-2B'!P34","v":0},0,0]
[{"$f":"'O1-2B'!P35","v":0},0,0]
[{"$f":"'O1-2B'!Q11","v":0},0,0]
[{"$f":"'O1-2B'!Q12","v":0},0,0]
[{"$f":"'O1-2B'!Q13","v":0},0,0]
[{"$f":"'O1-2B'!Q14","v":0},0,{"$f":"A4328*B4328","v":0}]
[{"$f":"'O1-2B'!Q15","v":0},0,0]
[{"$f":"'O1-2B'!Q16","v":0},0,0]
[{"$f":"'O1-2B'!Q17","v":0},0,0]
[{"$f":"'O1-2B'!Q18","v":0},0,0]
[{"$f":"'O1-2B'!Q19","v":0},0,0]
[{"$f":"'O1-2B'!Q20","v":0},0,0]
[{"$f":"'O1-2B'!Q21","v":0},0,0]
[{"$f":"'O1-2B'!Q22","v":0},0,0]
[{"$f":"'O1-2B'!Q23","v":0},0,0]
[{"$f":"'O1-2B'!Q24","v":0},0,0]
[{"$f":"'O1-2B'!Q25","v":0},0,0]
[{"$f":"'O1-2B'!Q26","v":0},0,0]
[{"$f":"'O1-2B'!Q27","v":0},0,0]
[{"$f":"'O1-2B'!Q28","v":0},0,0]
[{"$f":"'O1-2B'!Q29","v":0},0,0]
[{"$f":"'O1-2B'!Q30","v":0},0,0]
[{"$f":"'O1-2B'!Q31","v":0},0,0]
[{"$f":"'O1-2B'!Q32","v":0},0,0]
[{"$f":"'O1-2B'!Q33","v":0},0,0]
[{"$f":"'O1-2B'!Q34","v":0},0,0]
[{"$f":"'O1-2B'!Q35","v":0},0,0]
[{"$f":"'O1-2B'!Q42","v":0},0,0]
[{"$f":"'O1-2B'!Q43","v":0},0,0]
[{"$f":"'O1-2B'!Q44","v":0},0,0]
[{"$f":"'O1-2B'!Q45","v":0},0,0]
[{"$f":"'O1-2B'!Q46","v":0},0,0]
[{"$f":"'O1-2B'!Q47","v":0},0,0]
[{"$f":"'O1-2B'!Q48","v":0},0,0]
[{"$f":"'O1-2B'!Q49","v":0},0,0]
[{"$f":"'O1-2B'!Q50","v":0},0,0]
[{"$f":"'O1-2B'!R11","v":0},0,0]
[{"$f":"'O1-2B'!R12","v":0},0,0]
[{"$f":"'O1-2B'!R13","v":0},0,0]
[{"$f":"'O1-2B'!R14","v":0},0,0]
[{"$f":"'O1-2B'!R15","v":0},0,0]
[{"$f":"'O1-2B'!R16","v":0},0,0]
[{"$f":"'O1-2B'!R17","v":0},0,0]
[{"$f":"'O1-2B'!R18","v":0},0,0]
[{"$f":"'O1-2B'!R19","v":0},0,0]
[{"$f":"'O1-2B'!R20","v":0},0,0]
[{"$f":"'O1-2B'!R21","v":0},0,0]
[{"$f":"'O1-2B'!R22","v":0},0,0]
[{"$f":"'O1-2B'!R23","v":0},0,0]
[{"$f":"'O1-2B'!R24","v":0},0,0]
[{"$f":"'O1-2B'!R25","v":0},0,0]
[{"$f":"'O1-2B'!R26","v":0},0,0]
[{"$f":"'O1-2B'!R27","v":0},0,0]
[{"$f":"'O1-2B'!R28","v":0},0,0]
[{"$f":"'O1-2B'!R29","v":0},0,0]
[{"$f":"'O1-2B'!R30","v":0},0,0]
[{"$f":"'O1-2B'!R31","v":0},0,0]
[{"$f":"'O1-2B'!R32","v":0},0,0]
[{"$f":"'O1-2B'!R33","v":0},0,0]
[{"$f":"'O1-2B'!R34","v":0},0,0]
[{"$f":"'O1-2B'!R35","v":0},0,0]
[{"$f":"'O1-2B'!S11","v":0},0,0]
[{"$f":"'O1-2B'!S12","v":0},0,0]
[{"$f":"'O1-2B'!S13","v":0},0,0]
[{"$f":"'O1-2B'!S14","v":0},0,0]
[{"$f":"'O1-2B'!S15","v":0},0,0]
[{"$f":"'O1-2B'!S16","v":0},0,0]
[{"$f":"'O1-2B'!S17","v":0},0,0]
[{"$f":"'O1-2B'!S18","v":0},0,0]
[{"$f":"'O1-2B'!S19","v":0},0,{"$f":"A4392*B4392","v":0}]
[{"$f":"'O1-2B'!S20","v":0},0,0]
[{"$f":"'O1-2B'!S21","v":0},0,0]
[{"$f":"'O1-2B'!S22","v":0},0,0]
[{"$f":"'O1-2B'!S23","v":0},0,0]
[{"$f":"'O1-2B'!S24","v":0},0,0]
[{"$f":"'O1-2B'!S25","v":0},0,0]
[{"$f":"'O1-2B'!S26","v":0},0,0]
[{"$f":"'O1-2B'!S27","v":0},0,0]
[{"$f":"'O1-2B'!S28","v":0},0,0]
[{"$f":"'O1-2B'!S29","v":0},0,0]
[{"$f":"'O1-2B'!S30","v":0},0,0]
[{"$f":"'O1-2B'!S31","v":0},0,0]
[{"$f":"'O1-2B'!S32","v":0},0,0]
[{"$f":"'O1-2B'!S33","v":0},0,0]
[{"$f":"'O1-2B'!S34","v":0},0,0]
[{"$f":"'O1-2B'!S35","v":0},0,0]
[{"$f":"'O1-2B'!S42","v":0},0,0]
[{"$f":"'O1-2B'!S43","v":0},0,0]
[{"$f":"'O1-2B'!S44","v":0},0,0]
[{"$f":"'O1-2B'!S45","v":0},0,0]
[{"$f":"'O1-2B'!S46","v":0},0,0]
[{"$f":"'O1-2B'!S47","v":0},0,0]
[{"$f":"'O1-2B'!S48","v":0},0,0]
[{"$f":"'O1-2B'!S49","v":0},0,0]
[{"$f":"'O1-2B'!S50","v":0},0,0]
[{"$f":"'O1-2B'!T11","v":0},0,0]
[{"$f":"'O1-2B'!T12","v":0},0,0]
[{"$f":"'O1-2B'!T13","v":0},0,0]
[{"$f":"'O1-2B'!T14","v":0},0,0]
[{"$f":"'O1-2B'!T15","v":0},0,0]
[{"$f":"'O1-2B'!T16","v":0},0,0]
[{"$f":"'O1-2B'!T17","v":0},0,0]
[{"$f":"'O1-2B'!T18","v":0},0,0]
[{"$f":"'O1-2B'!T19","v":0},0,0]
[{"$f":"'O1-2B'!T20","v":0},0,0]
[{"$f":"'O1-2B'!T21","v":0},0,0]
[{"$f":"'O1-2B'!T22","v":0},0,0]
[{"$f":"'O1-2B'!T23","v":0},0,0]
[{"$f":"'O1-2B'!T24","v":0},0,0]
[{"$f":"'O1-2B'!T25","v":0},0,0]
[{"$f":"'O1-2B'!T26","v":0},0,0]
[{"$f":"'O1-2B'!T27","v":0},0,0]
[{"$f":"'O1-2B'!T28","v":0},0,0]
[{"$f":"'O1-2B'!T29","v":0},0,0]
[{"$f":"'O1-2B'!T30","v":0},0,0]
[{"$f":"'O1-2B'!T31","v":0},0,0]
[{"$f":"'O1-2B'!T32","v":0},0,0]
[{"$f":"'O1-2B'!T33","v":0},0,0]
[{"$f":"'O1-2B'!T34","v":0},0,0]
[{"$f":"'O1-2B'!T35","v":0},0,0]
[{"$f":"'O1-2K'!E10","v":0},0,0]
[{"$f":"'O1-2K'!E11","v":0},0,0]
[{"$f":"'O1-2K'!E12","v":0},0,0]
[{"$f":"'O1-2K'!E13","v":0},0,0]
[{"$f":"'O1-2K'!E14","v":0},0,0]
[{"$f":"'O1-2K'!E15","v":0},0,0]
[{"$f":"'O1-2K'!E16","v":0},0,0]
[{"$f":"'O1-2K'!E17","v":0},0,0]
[{"$f":"'O1-2K'!E18","v":0},0,0]
[{"$f":"'O1-2K'!E19","v":0},0,0]
[{"$f":"'O1-2K'!E20","v":0},0,0]
[{"$f":"'O1-2K'!E21","v":0},0,0]
[{"$f":"'O1-2K'!F10","v":0},0,0]
[{"$f":"'O1-2K'!F11","v":0},0,{"$f":"A4456*B4456","v":0}]
[{"$f":"'O1-2K'!F12","v":0},0,0]
[{"$f":"'O1-2K'!F13","v":0},0,0]
[{"$f":"'O1-2K'!F14","v":0},0,0]
[{"$f":"'O1-2K'!F15","v":0},0,0]
[{"$f":"'O1-2K'!F16","v":0},0,0]
[{"$f":"'O1-2K'!F17","v":0},0,0]
[{"$f":"'O1-2K'!F18","v":0},0,0]
[{"$f":"'O1-2K'!F19","v":0},0,0]
[{"$f":"'O1-2K'!F20","v":0},0,0]
[{"$f":"'O1-2K'!F21","v":0},0,0]
[{"$f":"'O1-2K'!G10","v":0},0,0]
[{"$f":"'O1-2K'!G11","v":0},0,0]
[{"$f":"'O1-2K'!G12","v":0},0,0]
[{"$f":"'O1-2K'!G13","v":0},0,0]
[{"$f":"'O1-2K'!G14","v":0},0,0]
[{"$f":"'O1-2K'!G15","v":0},0,0]
[{"$f":"'O1-2K'!G16","v":0},0,0]
[{"$f":"'O1-2K'!G17","v":0},0,0]
[{"$f":"'O1-2K'!G18","v":0},0,0]
[{"$f":"'O1-2K'!G19","v":0},0,0]
[{"$f":"'O1-2K'!G20","v":0},0,0]
[{"$f":"'O1-2K'!G21","v":0},0,0]
[{"$f":"'O1-2K'!H10","v":0},0,0]
[{"$f":"'O1-2K'!H11","v":0},0,0]
[{"$f":"'O1-2K'!H12","v":0},0,0]
[{"$f":"'O1-2K'!H13","v":0},0,0]
[{"$f":"'O1-2K'!H14","v":0},0,0]
[{"$f":"'O1-2K'!H15","v":0},0,0]
[{"$f":"'O1-2K'!H16","v":0},0,0]
[{"$f":"'O1-2K'!H17","v":0},0,0]
[{"$f":"'O1-2K'!H18","v":0},0,0]
[{"$f":"'O1-2K'!H19","v":0},0,0]
[{"$f":"'O1-2K'!H20","v":0},0,0]
[{"$f":"'O1-2K'!H21","v":0},0,0]
[{"$f":"'O1-2K'!I10","v":0},0,0]
[{"$f":"'O1-2K'!I11","v":0},0,0]
[{"$f":"'O1-2K'!I12","v":0},0,0]
[{"$f":"'O1-2K'!I13","v":0},0,0]
[{"$f":"'O1-2K'!I14","v":0},0,0]
[{"$f":"'O1-2K'!I15","v":0},0,0]
[{"$f":"'O1-2K'!I16","v":0},0,0]
[{"$f":"'O1-2K'!I17","v":0},0,0]
[{"$f":"'O1-2K'!I18","v":0},0,0]
[{"$f":"'O1-2K'!I19","v":0},0,0]
[{"$f":"'O1-2K'!I20","v":0},0,0]
[{"$f":"'O1-2K'!I21","v":0},0,0]
[{"$f":"'O1-2K'!J10","v":0},0,0]
[{"$f":"'O1-2K'!J11","v":0},0,0]
[{"$f":"'O1-2K'!J12","v":0},0,0]
[{"$f":"'O1-2K'!J13","v":0},0,0]
[{"$f":"'O1-2K'!J14","v":0},0,0]
[{"$f":"'O1-2K'!J15","v":0},0,0]
[{"$f":"'O1-2K'!J16","v":0},0,0]
[{"$f":"'O1-2K'!J17","v":0},0,0]
[{"$f":"'O1-2K'!J18","v":0},0,0]
[{"$f":"'O1-2K'!J19","v":0},0,0]
[{"$f":"'O1-2K'!J20","v":0},0,0]
[{"$f":"'O1-2K'!J21","v":0},0,0]
[{"$f":"'O1-3'!E11","v":0},0,0]
[{"$f":"'O1-3'!E12","v":0},0,0]
[{"$f":"'O1-3'!E13","v":0},0,0]
[{"$f":"'O1-3'!E14","v":0},0,0]
[{"$f":"'O1-3'!E15","v":0},0,0]
[{"$f":"'O1-3'!E16","v":0},0,{"$f":"A4520*B4520","v":0}]
[{"$f":"'O1-3'!E17","v":0},0,0]
[{"$f":"'O1-3'!E18","v":0},0,0]
[{"$f":"'O1-3'!E19","v":0},0,0]
[{"$f":"'O1-3'!E20","v":0},0,0]
[{"$f":"'O1-3'!E21","v":0},0,0]
[{"$f":"'O1-3'!E22","v":0},0,0]
[{"$f":"'O1-3'!E23","v":0},0,0]
[{"$f":"'O1-3'!E24","v":0},0,0]
[{"$f":"'O1-3'!E25","v":0},0,0]
[{"$f":"'O1-3'!E26","v":0},0,0]
[{"$f":"'O1-3'!E27","v":0},0,0]
[{"$f":"'O1-3'!E28","v":0},0,0]
[{"$f":"'O1-3'!E29","v":0},0,0]
[{"$f":"'O1-3'!E30","v":0},0,0]
[{"$f":"'O1-3'!E31","v":0},0,0]
[{"$f":"'O1-3'!E32","v":0},0,0]
[{"$f":"'O1-3'!E33","v":0},0,0]
[{"$f":"'O1-3'!E34","v":0},0,0]
[{"$f":"'O1-3'!E35","v":0},0,0]
[{"$f":"'O1-3'!E42","v":0},0,0]
[{"$f":"'O1-3'!E43","v":0},0,0]
[{"$f":"'O1-3'!E44","v":0},0,0]
[{"$f":"'O1-3'!E45","v":0},0,0]
[{"$f":"'O1-3'!E46","v":0},0,0]
[{"$f":"'O1-3'!E47","v":0},0,0]
[{"$f":"'O1-3'!E48","v":0},0,0]
[{"$f":"'O1-3'!E49","v":0},0,0]
[{"$f":"'O1-3'!E50","v":0},0,0]
[{"$f":"'O1-3'!E51","v":0},0,0]
[{"$f":"'O1-3'!E52","v":0},0,0]
[{"$f":"'O1-3'!E53","v":0},0,0]
[{"$f":"'O1-3'!F11","v":0},0,0]
[{"$f":"'O1-3'!F12","v":0},0,0]
[{"$f":"'O1-3'!F13","v":0},0,0]
[{"$f":"'O1-3'!F14","v":0},0,0]
[{"$f":"'O1-3'!F15","v":0},0,0]
[{"$f":"'O1-3'!F16","v":0},0,0]
[{"$f":"'O1-3'!F17","v":0},0,0]
[{"$f":"'O1-3'!F18","v":0},0,0]
[{"$f":"'O1-3'!F19","v":0},0,0]
[{"$f":"'O1-3'!F20","v":0},0,0]
[{"$f":"'O1-3'!F21","v":0},0,0]
[{"$f":"'O1-3'!F22","v":0},0,0]
[{"$f":"'O1-3'!F23","v":0},0,0]
[{"$f":"'O1-3'!F24","v":0},0,0]
[{"$f":"'O1-3'!F25","v":0},0,0]
[{"$f":"'O1-3'!F26","v":0},0,0]
[{"$f":"'O1-3'!F27","v":0},0,0]
[{"$f":"'O1-3'!F28","v":0},0,0]
[{"$f":"'O1-3'!F29","v":0},0,0]
[{"$f":"'O1-3'!F30","v":0},0,0]
[{"$f":"'O1-3'!F31","v":0},0,0]
[{"$f":"'O1-3'!F32","v":0},0,0]
[{"$f":"'O1-3'!F33","v":0},0,0]
[{"$f":"'O1-3'!F34","v":0},0,0]
[{"$f":"'O1-3'!F35","v":0},0,0]
[{"$f":"'O1-3'!G11","v":0},0,0]
[{"$f":"'O1-3'!G12","v":0},0,0]
[{"$f":"'O1-3'!G13","v":0},0,0]
[{"$f":"'O1-3'!G14","v":0},0,0]
[{"$f":"'O1-3'!G15","v":0},0,0]
[{"$f":"'O1-3'!G16","v":0},0,0]
[{"$f":"'O1-3'!G17","v":0},0,0]
[{"$f":"'O1-3'!G18","v":0},0,{"$f":"A4584*B4584","v":0}]
[{"$f":"'O1-3'!G19","v":0},0,0]
[{"$f":"'O1-3'!G20","v":0},0,0]
[{"$f":"'O1-3'!G21","v":0},0,0]
[{"$f":"'O1-3'!G22","v":0},0,0]
[{"$f":"'O1-3'!G23","v":0},0,0]
[{"$f":"'O1-3'!G24","v":0},0,0]
[{"$f":"'O1-3'!G25","v":0},0,0]
[{"$f":"'O1-3'!G26","v":0},0,0]
[{"$f":"'O1-3'!G27","v":0},0,0]
[{"$f":"'O1-3'!G28","v":0},0,0]
[{"$f":"'O1-3'!G29","v":0},0,0]
[{"$f":"'O1-3'!G30","v":0},0,0]
[{"$f":"'O1-3'!G31","v":0},0,0]
[{"$f":"'O1-3'!G32","v":0},0,0]
[{"$f":"'O1-3'!G33","v":0},0,0]
[{"$f":"'O1-3'!G34","v":0},0,0]
[{"$f":"'O1-3'!G35","v":0},0,0]
[{"$f":"'O1-3'!G42","v":0},0,0]
[{"$f":"'O1-3'!G43","v":0},0,0]
[{"$f":"'O1-3'!G44","v":0},0,0]
[{"$f":"'O1-3'!G45","v":0},0,0]
[{"$f":"'O1-3'!G46","v":0},0,0]
[{"$f":"'O1-3'!G47","v":0},0,0]
[{"$f":"'O1-3'!G48","v":0},0,0]
[{"$f":"'O1-3'!G49","v":0},0,0]
[{"$f":"'O1-3'!G50","v":0},0,0]
[{"$f":"'O1-3'!G51","v":0},0,0]
[{"$f":"'O1-3'!G52","v":0},0,0]
[{"$f":"'O1-3'!G53","v":0},0,0]
[{"$f":"'O1-3'!H11","v":0},0,0]
[{"$f":"'O1-3'!H12","v":0},0,0]
[{"$f":"'O1-3'!H13","v":0},0,0]
[{"$f":"'O1-3'!H14","v":0},0,0]
[{"$f":"'O1-3'!H15","v":0},0,0]
[{"$f":"'O1-3'!H16","v":0},0,0]
[{"$f":"'O1-3'!H17","v":0},0,0]
[{"$f":"'O1-3'!H18","v":0},0,0]
[{"$f":"'O1-3'!H19","v":0},0,0]
[{"$f":"'O1-3'!H20","v":0},0,0]
[{"$f":"'O1-3'!H21","v":0},0,0]
[{"$f":"'O1-3'!H22","v":0},0,0]
[{"$f":"'O1-3'!H23","v":0},0,0]
[{"$f":"'O1-3'!H24","v":0},0,0]
[{"$f":"'O1-3'!H25","v":0},0,0]
[{"$f":"'O1-3'!H26","v":0},0,0]
[{"$f":"'O1-3'!H27","v":0},0,0]
[{"$f":"'O1-3'!H28","v":0},0,0]
[{"$f":"'O1-3'!H29","v":0},0,0]
[{"$f":"'O1-3'!H30","v":0},0,0]
[{"$f":"'O1-3'!H31","v":0},0,0]
[{"$f":"'O1-3'!H32","v":0},0,0]
[{"$f":"'O1-3'!H33","v":0},0,0]
[{"$f":"'O1-3'!H34","v":0},0,0]
[{"$f":"'O1-3'!H35","v":0},0,0]
[{"$f":"'O1-3'!I11","v":0},0,0]
[{"$f":"'O1-3'!I12","v":0},0,0]
[{"$f":"'O1-3'!I13","v":0},0,0]
[{"$f":"'O1-3'!I14","v":0},0,0]
[{"$f":"'O1-3'!I15","v":0},0,0]
[{"$f":"'O1-3'!I16","v":0},0,0]
[{"$f":"'O1-3'!I17","v":0},0,0]
[{"$f":"'O1-3'!I18","v":0},0,0]
[{"$f":"'O1-3'!I19","v":0},0,0]
[{"$f":"'O1-3'!I20","v":0},0,{"$f":"A4648*B4648","v":0}]
[{"$f":"'O1-3'!I21","v":0},0,0]
[{"$f":"'O1-3'!I22","v":0},0,0]
[{"$f":"'O1-3'!I23","v":0},0,0]
[{"$f":"'O1-3'!I24","v":0},0,0]
[{"$f":"'O1-3'!I25","v":0},0,0]
[{"$f":"'O1-3'!I26","v":0},0,0]
[{"$f":"'O1-3'!I27","v":0},0,0]
[{"$f":"'O1-3'!I28","v":0},0,0]
[{"$f":"'O1-3'!I29","v":0},0,0]
[{"$f":"'O1-3'!I30","v":0},0,0]
[{"$f":"'O1-3'!I31","v":0},0,0]
[{"$f":"'O1-3'!I32","v":0},0,0]
[{"$f":"'O1-3'!I33","v":0},0,0]
[{"$f":"'O1-3'!I34","v":0},0,0]
[{"$f":"'O1-3'!I35","v":0},0,0]
[{"$f":"'O1-3'!I42","v":0},0,0]
[{"$f":"'O1-3'!I43","v":0},0,0]
[{"$f":"'O1-3'!I44","v":0},0,0]
[{"$f":"'O1-3'!I45","v":0},0,0]
[{"$f":"'O1-3'!I46","v":0},0,0]
[{"$f":"'O1-3'!I47","v":0},0,0]
[{"$f":"'O1-3'!I48","v":0},0,0]
[{"$f":"'O1-3'!I49","v":0},0,0]
[{"$f":"'O1-3'!I50","v":0},0,0]
[{"$f":"'O1-3'!I51","v":0},0,0]
[{"$f":"'O1-3'!I52","v":0},0,0]
[{"$f":"'O1-3'!I53","v":0},0,0]
[{"$f":"'O1-3'!J11","v":0},0,0]
[{"$f":"'O1-3'!J12","v":0},0,0]
[{"$f":"'O1-3'!J13","v":0},0,0]
[{"$f":"'O1-3'!J14","v":0},0,0]
[{"$f":"'O1-3'!J15","v":0},0,0]
[{"$f":"'O1-3'!J16","v":0},0,0]
[{"$f":"'O1-3'!J17","v":0},0,0]
[{"$f":"'O1-3'!J18","v":0},0,0]
[{"$f":"'O1-3'!J19","v":0},0,0]
[{"$f":"'O1-3'!J20","v":0},0,0]
[{"$f":"'O1-3'!J21","v":0},0,0]
[{"$f":"'O1-3'!J22","v":0},0,0]
[{"$f":"'O1-3'!J23","v":0},0,0]
[{"$f":"'O1-3'!J24","v":0},0,0]
[{"$f":"'O1-3'!J25","v":0},0,0]
[{"$f":"'O1-3'!J26","v":0},0,0]
[{"$f":"'O1-3'!J27","v":0},0,0]
[{"$f":"'O1-3'!J28","v":0},0,0]
[{"$f":"'O1-3'!J29","v":0},0,0]
[{"$f":"'O1-3'!J30","v":0},0,0]
[{"$f":"'O1-3'!J31","v":0},0,0]
[{"$f":"'O1-3'!J32","v":0},0,0]
[{"$f":"'O1-3'!J33","v":0},0,0]
[{"$f":"'O1-3'!J34","v":0},0,0]
[{"$f":"'O1-3'!J35","v":0},0,0]
[{"$f":"'O1-3'!K11","v":0},0,0]
[{"$f":"'O1-3'!K12","v":0},0,0]
[{"$f":"'O1-3'!K13","v":0},0,0]
[{"$f":"'O1-3'!K14","v":0},0,0]
[{"$f":"'O1-3'!K15","v":0},0,0]
[{"$f":"'O1-3'!K16","v":0},0,0]
[{"$f":"'O1-3'!K17","v":0},0,0]
[{"$f":"'O1-3'!K18","v":0},0,0]
[{"$f":"'O1-3'!K19","v":0},0,0]
[{"$f":"'O1-3'!K20","v":0},0,0]
[{"$f":"'O1-3'!K21","v":0},0,0]
[{"$f":"'O1-3'!K22","v":0},0,{"$f":"A4712*B4712","v":0}]
[{"$f":"'O1-3'!K23","v":0},0,0]
[{"$f":"'O1-3'!K24","v":0},0,0]
[{"$f":"'O1-3'!K25","v":0},0,0]
[{"$f":"'O1-3'!K26","v":0},0,0]
[{"$f":"'O1-3'!K27","v":0},0,0]
[{"$f":"'O1-3'!K28","v":0},0,0]
[{"$f":"'O1-3'!K29","v":0},0,0]
[{"$f":"'O1-3'!K30","v":0},0,0]
[{"$f":"'O1-3'!K31","v":0},0,0]
[{"$f":"'O1-3'!K32","v":0},0,0]
[{"$f":"'O1-3'!K33","v":0},0,0]
[{"$f":"'O1-3'!K34","v":0},0,0]
[{"$f":"'O1-3'!K35","v":0},0,0]
[{"$f":"'O1-3'!K42","v":0},0,0]
[{"$f":"'O1-3'!K43","v":0},0,0]
[{"$f":"'O1-3'!K44","v":0},0,0]
[{"$f":"'O1-3'!K45","v":0},0,0]
[{"$f":"'O1-3'!K46","v":0},0,0]
[{"$f":"'O1-3'!K47","v":0},0,0]
[{"$f":"'O1-3'!K48","v":0},0,0]
[{"$f":"'O1-3'!K49","v":0},0,0]
[{"$f":"'O1-3'!K50","v":0},0,0]
[{"$f":"'O1-3'!K51","v":0},0,0]
[{"$f":"'O1-3'!K52","v":0},0,0]
[{"$f":"'O1-3'!K53","v":0},0,0]
[{"$f":"'O1-3'!L11","v":0},0,0]
[{"$f":"'O1-3'!L12","v":0},0,0]
[{"$f":"'O1-3'!L13","v":0},0,0]
[{"$f":"'O1-3'!L14","v":0},0,0]
[{"$f":"'O1-3'!L15","v":0},0,0]
[{"$f":"'O1-3'!L16","v":0},0,0]
[{"$f":"'O1-3'!L17","v":0},0,0]
[{"$f":"'O1-3'!L18","v":0},0,0]
[{"$f":"'O1-3'!L19","v":0},0,0]
[{"$f":"'O1-3'!L20","v":0},0,0]
[{"$f":"'O1-3'!L21","v":0},0,0]
[{"$f":"'O1-3'!L22","v":0},0,0]
[{"$f":"'O1-3'!L23","v":0},0,0]
[{"$f":"'O1-3'!L24","v":0},0,0]
[{"$f":"'O1-3'!L25","v":0},0,0]
[{"$f":"'O1-3'!L26","v":0},0,0]
[{"$f":"'O1-3'!L27","v":0},0,0]
[{"$f":"'O1-3'!L28","v":0},0,0]
[{"$f":"'O1-3'!L29","v":0},0,0]
[{"$f":"'O1-3'!L30","v":0},0,0]
[{"$f":"'O1-3'!L31","v":0},0,0]
[{"$f":"'O1-3'!L32","v":0},0,0]
[{"$f":"'O1-3'!L33","v":0},0,0]
[{"$f":"'O1-3'!L34","v":0},0,0]
[{"$f":"'O1-3'!L35","v":0},0,0]
[{"$f":"'O1-3'!M11","v":0},0,0]
[{"$f":"'O1-3'!M12","v":0},0,0]
[{"$f":"'O1-3'!M13","v":0},0,0]
[{"$f":"'O1-3'!M14","v":0},0,0]
[{"$f":"'O1-3'!M15","v":0},0,0]
[{"$f":"'O1-3'!M16","v":0},0,0]
[{"$f":"'O1-3'!M17","v":0},0,0]
[{"$f":"'O1-3'!M18","v":0},0,0]
[{"$f":"'O1-3'!M19","v":0},0,0]
[{"$f":"'O1-3'!M20","v":0},0,0]
[{"$f":"'O1-3'!M21","v":0},0,0]
[{"$f":"'O1-3'!M22","v":0},0,0]
[{"$f":"'O1-3'!M23","v":0},0,0]
[{"$f":"'O1-3'!M24","v":0},0,{"$f":"A4776*B4776","v":0}]
[{"$f":"'O1-3'!M25","v":0},0,0]
[{"$f":"'O1-3'!M26","v":0},0,0]
[{"$f":"'O1-3'!M27","v":0},0,0]
[{"$f":"'O1-3'!M28","v":0},0,0]
[{"$f":"'O1-3'!M29","v":0},0,0]
[{"$f":"'O1-3'!M30","v":0},0,0]
[{"$f":"'O1-3'!M31","v":0},0,0]
[{"$f":"'O1-3'!M32","v":0},0,0]
[{"$f":"'O1-3'!M33","v":0},0,0]
[{"$f":"'O1-3'!M34","v":0},0,0]
[{"$f":"'O1-3'!M35","v":0},0,0]
[{"$f":"'O1-3'!M42","v":0},0,0]
[{"$f":"'O1-3'!M43","v":0},0,0]
[{"$f":"'O1-3'!M44","v":0},0,0]
[{"$f":"'O1-3'!M45","v":0},0,0]
[{"$f":"'O1-3'!M46","v":0},0,0]
[{"$f":"'O1-3'!M47","v":0},0,0]
[{"$f":"'O1-3'!M48","v":0},0,0]
[{"$f":"'O1-3'!M49","v":0},0,0]
[{"$f":"'O1-3'!M50","v":0},0,0]
[{"$f":"'O1-3'!M51","v":0},0,0]
[{"$f":"'O1-3'!M52","v":0},0,0]
[{"$f":"'O1-3'!M53","v":0},0,0]
[{"$f":"'O1-3'!N11","v":0},0,0]
[{"$f":"'O1-3'!N12","v":0},0,0]
[{"$f":"'O1-3'!N13","v":0},0,0]
[{"$f":"'O1-3'!N14","v":0},0,0]
[{"$f":"'O1-3'!N15","v":0},0,0]
[{"$f":"'O1-3'!N16","v":0},0,0]
[{"$f":"'O1-3'!N17","v":0},0,0]
[{"$f":"'O1-3'!N18","v":0},0,0]
[{"$f":"'O1-3'!N19","v":0},0,0]
[{"$f":"'O1-3'!N20","v":0},0,0]
[{"$f":"'O1-3'!N21","v":0},0,0]
[{"$f":"'O1-3'!N22","v":0},0,0]
[{"$f":"'O1-3'!N23","v":0},0,0]
[{"$f":"'O1-3'!N24","v":0},0,0]
[{"$f":"'O1-3'!N25","v":0},0,0]
[{"$f":"'O1-3'!N26","v":0},0,0]
[{"$f":"'O1-3'!N27","v":0},0,0]
[{"$f":"'O1-3'!N28","v":0},0,0]
[{"$f":"'O1-3'!N29","v":0},0,0]
[{"$f":"'O1-3'!N30","v":0},0,0]
[{"$f":"'O1-3'!N31","v":0},0,0]
[{"$f":"'O1-3'!N32","v":0},0,0]
[{"$f":"'O1-3'!N33","v":0},0,0]
[{"$f":"'O1-3'!N34","v":0},0,0]
[{"$f":"'O1-3'!N35","v":0},0,0]
[{"$f":"'O1-3'!O11","v":0},0,0]
[{"$f":"'O1-3'!O12","v":0},0,0]
[{"$f":"'O1-3'!O13","v":0},0,0]
[{"$f":"'O1-3'!O14","v":0},0,0]
[{"$f":"'O1-3'!O15","v":0},0,0]
[{"$f":"'O1-3'!O16","v":0},0,0]
[{"$f":"'O1-3'!O17","v":0},0,0]
[{"$f":"'O1-3'!O18","v":0},0,0]
[{"$f":"'O1-3'!O19","v":0},0,0]
[{"$f":"'O1-3'!O20","v":0},0,0]
[{"$f":"'O1-3'!O21","v":0},0,0]
[{"$f":"'O1-3'!O22","v":0},0,0]
[{"$f":"'O1-3'!O23","v":0},0,0]
[{"$f":"'O1-3'!O24","v":0},0,0]
[{"$f":"'O1-3'!O25","v":0},0,0]
[{"$f":"'O1-3'!O26","v":0},0,{"$f":"A4840*B4840","v":0}]
[{"$f":"'O1-3'!O27","v":0},0,0]
[{"$f":"'O1-3'!O28","v":0},0,0]
[{"$f":"'O1-3'!O29","v":0},0,0]
[{"$f":"'O1-3'!O30","v":0},0,0]
[{"$f":"'O1-3'!O31","v":0},0,0]
[{"$f":"'O1-3'!O32","v":0},0,0]
[{"$f":"'O1-3'!O33","v":0},0,0]
[{"$f":"'O1-3'!O34","v":0},0,0]
[{"$f":"'O1-3'!O35","v":0},0,0]
[{"$f":"'O1-3'!O42","v":0},0,0]
[{"$f":"'O1-3'!O43","v":0},0,0]
[{"$f":"'O1-3'!O44","v":0},0,0]
[{"$f":"'O1-3'!O45","v":0},0,0]
[{"$f":"'O1-3'!O46","v":0},0,0]
[{"$f":"'O1-3'!O47","v":0},0,0]
[{"$f":"'O1-3'!O48","v":0},0,0]
[{"$f":"'O1-3'!O49","v":0},0,0]
[{"$f":"'O1-3'!O50","v":0},0,0]
[{"$f":"'O1-3'!O51","v":0},0,0]
[{"$f":"'O1-3'!O52","v":0},0,0]
[{"$f":"'O1-3'!O53","v":0},0,0]
[{"$f":"'O1-3'!P11","v":0},0,0]
[{"$f":"'O1-3'!P12","v":0},0,0]
[{"$f":"'O1-3'!P13","v":0},0,0]
[{"$f":"'O1-3'!P14","v":0},0,0]
[{"$f":"'O1-3'!P15","v":0},0,0]
[{"$f":"'O1-3'!P16","v":0},0,0]
[{"$f":"'O1-3'!P17","v":0},0,0]
[{"$f":"'O1-3'!P18","v":0},0,0]
[{"$f":"'O1-3'!P19","v":0},0,0]
[{"$f":"'O1-3'!P20","v":0},0,0]
[{"$f":"'O1-3'!P21","v":0},0,0]
[{"$f":"'O1-3'!P22","v":0},0,0]
[{"$f":"'O1-3'!P23","v":0},0,0]
[{"$f":"'O1-3'!P24","v":0},0,0]
[{"$f":"'O1-3'!P25","v":0},0,0]
[{"$f":"'O1-3'!P26","v":0},0,0]
[{"$f":"'O1-3'!P27","v":0},0,0]
[{"$f":"'O1-3'!P28","v":0},0,0]
[{"$f":"'O1-3'!P29","v":0},0,0]
[{"$f":"'O1-3'!P30","v":0},0,0]
[{"$f":"'O1-3'!P31","v":0},0,0]
[{"$f":"'O1-3'!P32","v":0},0,0]
[{"$f":"'O1-3'!P33","v":0},0,0]
[{"$f":"'O1-3'!P34","v":0},0,0]
[{"$f":"'O1-3'!P35","v":0},0,0]
[{"$f":"'O1-3'!Q11","v":0},0,0]
[{"$f":"'O1-3'!Q12","v":0},0,0]
[{"$f":"'O1-3'!Q13","v":0},0,0]
[{"$f":"'O1-3'!Q14","v":0},0,0]
[{"$f":"'O1-3'!Q15","v":0},0,0]
[{"$f":"'O1-3'!Q16","v":0},0,0]
[{"$f":"'O1-3'!Q17","v":0},0,0]
[{"$f":"'O1-3'!Q18","v":0},0,0]
[{"$f":"'O1-3'!Q19","v":0},0,0]
[{"$f":"'O1-3'!Q20","v":0},0,0]
[{"$f":"'O1-3'!Q21","v":0},0,0]
[{"$f":"'O1-3'!Q22","v":0},0,0]
[{"$f":"'O1-3'!Q23","v":0},0,0]
[{"$f":"'O1-3'!Q24","v":0},0,0]
[{"$f":"'O1-3'!Q25","v":0},0,0]
[{"$f":"'O1-3'!Q26","v":0},0,0]
[{"$f":"'O1-3'!Q27","v":0},0,0]
[{"$f":"'O1-3'!Q28","v":0},0,{"$f":"A4904*B4904","v":0}]
[{"$f":"'O1-3'!Q29","v":0},0,0]
[{"$f":"'O1-3'!Q30","v":0},0,0]
[{"$f":"'O1-3'!Q31","v":0},0,0]
[{"$f":"'O1-3'!Q32","v":0},0,0]
[{"$f":"'O1-3'!Q33","v":0},0,0]
[{"$f":"'O1-3'!Q34","v":0},0,0]
[{"$f":"'O1-3'!Q35","v":0},0,0]
[{"$f":"'O1-3'!Q42","v":0},0,0]
[{"$f":"'O1-3'!Q43","v":0},0,0]
[{"$f":"'O1-3'!Q44","v":0},0,0]
[{"$f":"'O1-3'!Q45","v":0},0,0]
[{"$f":"'O1-3'!Q46","v":0},0,0]
[{"$f":"'O1-3'!Q47","v":0},0,0]
[{"$f":"'O1-3'!Q48","v":0},0,0]
[{"$f":"'O1-3'!Q49","v":0},0,0]
[{"$f":"'O1-3'!Q50","v":0},0,0]
[{"$f":"'O1-3'!Q51","v":0},0,0]
[{"$f":"'O1-3'!Q52","v":0},0,0]
[{"$f":"'O1-3'!Q53","v":0},0,0]
[{"$f":"'O1-3'!R11","v":0},0,0]
[{"$f":"'O1-3'!R12","v":0},0,0]
[{"$f":"'O1-3'!R13","v":0},0,0]
[{"$f":"'O1-3'!R14","v":0},0,0]
[{"$f":"'O1-3'!R15","v":0},0,0]
[{"$f":"'O1-3'!R16","v":0},0,0]
[{"$f":"'O1-3'!R17","v":0},0,0]
[{"$f":"'O1-3'!R18","v":0},0,0]
[{"$f":"'O1-3'!R19","v":0},0,0]
[{"$f":"'O1-3'!R20","v":0},0,0]
[{"$f":"'O1-3'!R21","v":0},0,0]
[{"$f":"'O1-3'!R22","v":0},0,0]
[{"$f":"'O1-3'!R23","v":0},0,0]
[{"$f":"'O1-3'!R24","v":0},0,0]
[{"$f":"'O1-3'!R25","v":0},0,0]
[{"$f":"'O1-3'!R26","v":0},0,0]
[{"$f":"'O1-3'!R27","v":0},0,0]
[{"$f":"'O1-3'!R28","v":0},0,0]
[{"$f":"'O1-3'!R29","v":0},0,0]
[{"$f":"'O1-3'!R30","v":0},0,0]
[{"$f":"'O1-3'!R31","v":0},0,0]
[{"$f":"'O1-3'!R32","v":0},0,0]
[{"$f":"'O1-3'!R33","v":0},0,0]
[{"$f":"'O1-3'!R34","v":0},0,0]
[{"$f":"'O1-3'!R35","v":0},0,0]
[{"$f":"'O1-3'!S11","v":0},0,0]
[{"$f":"'O1-3'!S12","v":0},0,0]
[{"$f":"'O1-3'!S13","v":0},0,0]
[{"$f":"'O1-3'!S14","v":0},0,0]
[{"$f":"'O1-3'!S15","v":0},0,0]
[{"$f":"'O1-3'!S16","v":0},0,0]
[{"$f":"'O1-3'!S17","v":0},0,0]
[{"$f":"'O1-3'!S18","v":0},0,0]
[{"$f":"'O1-3'!S19","v":0},0,0]
[{"$f":"'O1-3'!S20","v":0},0,0]
[{"$f":"'O1-3'!S21","v":0},0,0]
[{"$f":"'O1-3'!S22","v":0},0,0]
[{"$f":"'O1-3'!S23","v":0},0,0]
[{"$f":"'O1-3'!S24","v":0},0,0]
[{"$f":"'O1-3'!S25","v":0},0,0]
[{"$f":"'O1-3'!S26","v":0},0,0]
[{"$f":"'O1-3'!S27","v":0},0,0]
[{"$f":"'O1-3'!S28","v":0},0,0]
[{"$f":"'O1-3'!S29","v":0},0,0]
[{"$f":"'O1-3'!S30","v":0},0,{"$f":"A4968*B4968","v":0}]
[{"$f":"'O1-3'!S31","v":0},0,0]
[{"$f":"'O1-3'!S32","v":0},0,0]
[{"$f":"'O1-3'!S33","v":0},0,0]
[{"$f":"'O1-3'!S34","v":0},0,0]
[{"$f":"'O1-3'!S35","v":0},0,0]
[{"$f":"'O1-3'!S42","v":0},0,0]
[{"$f":"'O1-3'!S43","v":0},0,0]
[{"$f":"'O1-3'!S44","v":0},0,0]
[{"$f":"'O1-3'!S45","v":0},0,0]
[{"$f":"'O1-3'!S46","v":0},0,0]
[{"$f":"'O1-3'!S47","v":0},0,0]
[{"$f":"'O1-3'!S48","v":0},0,0]
[{"$f":"'O1-3'!S49","v":0},0,0]
[{"$f":"'O1-3'!S50","v":0},0,0]
[{"$f":"'O1-3'!S51","v":0},0,0]
[{"$f":"'O1-3'!S52","v":0},0,0]
[{"$f":"'O1-3'!S53","v":0},0,0]
[{"$f":"'O1-3'!T11","v":0},0,0]
[{"$f":"'O1-3'!T12","v":0},0,0]
[{"$f":"'O1-3'!T13","v":0},0,0]
[{"$f":"'O1-3'!T14","v":0},0,0]
[{"$f":"'O1-3'!T15","v":0},0,0]
[{"$f":"'O1-3'!T16","v":0},0,0]
[{"$f":"'O1-3'!T17","v":0},0,0]
[{"$f":"'O1-3'!T18","v":0},0,0]
[{"$f":"'O1-3'!T19","v":0},0,0]
[{"$f":"'O1-3'!T20","v":0},0,0]
[{"$f":"'O1-3'!T21","v":0},0,0]
[{"$f":"'O1-3'!T22","v":0},0,0]
[{"$f":"'O1-3'!T23","v":0},0,0]
[{"$f":"'O1-3'!T24","v":0},0,0]
[{"$f":"'O1-3'!T25","v":0},0,0]
[{"$f":"'O1-3'!T26","v":0},0,0]
[{"$f":"'O1-3'!T27","v":0},0,0]
[{"$f":"'O1-3'!T28","v":0},0,0]
[{"$f":"'O1-3'!T29","v":0},0,0]
[{"$f":"'O1-3'!T30","v":0},0,0]
[{"$f":"'O1-3'!T31","v":0},0,0]
[{"$f":"'O1-3'!T32","v":0},0,0]
[{"$f":"'O1-3'!T33","v":0},0,0]
[{"$f":"'O1-3'!T34","v":0},0,0]
[{"$f":"'O1-3'!T35","v":0},0,0]
[{"$f":"'O1-3K'!E11","v":0},0,0]
[{"$f":"'O1-3K'!E12","v":0},0,0]
[{"$f":"'O1-3K'!E13","v":0},0,0]
[{"$f":"'O1-3K'!E14","v":0},0,0]
[{"$f":"'O1-3K'!E15","v":0},0,0]
[{"$f":"'O1-3K'!E16","v":0},0,0]
[{"$f":"'O1-3K'!E17","v":0},0,0]
[{"$f":"'O1-3K'!E18","v":0},0,0]
[{"$f":"'O1-3K'!E19","v":0},0,0]
[{"$f":"'O1-3K'!E20","v":0},0,0]
[{"$f":"'O1-3K'!E21","v":0},0,0]
[{"$f":"'O1-3K'!E22","v":0},0,0]
[{"$f":"'O1-3K'!F11","v":0},0,0]
[{"$f":"'O1-3K'!F12","v":0},0,0]
[{"$f":"'O1-3K'!F13","v":0},0,0]
[{"$f":"'O1-3K'!F14","v":0},0,0]
[{"$f":"'O1-3K'!F15","v":0},0,0]
[{"$f":"'O1-3K'!F16","v":0},0,0]
[{"$f":"'O1-3K'!F17","v":0},0,0]
[{"$f":"'O1-3K'!F18","v":0},0,0]
[{"$f":"'O1-3K'!F19","v":0},0,0]
[{"$f":"'O1-3K'!F20","v":0},0,{"$f":"A5032*B5032","v":0}]
[{"$f":"'O1-3K'!F21","v":0},0,0]
[{"$f":"'O1-3K'!F22","v":0},0,0]
[{"$f":"'O1-3K'!G11","v":0},0,0]
[{"$f":"'O1-3K'!G12","v":0},0,0]
[{"$f":"'O1-3K'!G13","v":0},0,0]
[{"$f":"'O1-3K'!G14","v":0},0,0]
[{"$f":"'O1-3K'!G15","v":0},0,0]
[{"$f":"'O1-3K'!G16","v":0},0,0]
[{"$f":"'O1-3K'!G17","v":0},0,0]
[{"$f":"'O1-3K'!G18","v":0},0,0]
[{"$f":"'O1-3K'!G19","v":0},0,0]
[{"$f":"'O1-3K'!G20","v":0},0,0]
[{"$f":"'O1-3K'!G21","v":0},0,0]
[{"$f":"'O1-3K'!G22","v":0},0,0]
[{"$f":"'O1-3K'!H11","v":0},0,0]
[{"$f":"'O1-3K'!H12","v":0},0,0]
[{"$f":"'O1-3K'!H13","v":0},0,0]
[{"$f":"'O1-3K'!H14","v":0},0,0]
[{"$f":"'O1-3K'!H15","v":0},0,0]
[{"$f":"'O1-3K'!H16","v":0},0,0]
[{"$f":"'O1-3K'!H17","v":0},0,0]
[{"$f":"'O1-3K'!H18","v":0},0,0]
[{"$f":"'O1-3K'!H19","v":0},0,0]
[{"$f":"'O1-3K'!H20","v":0},0,0]
[{"$f":"'O1-3K'!H21","v":0},0,0]
[{"$f":"'O1-3K'!H22","v":0},0,0]
[{"$f":"'O2'!E10","v":0},0,0]
[{"$f":"'O2'!E11","v":0},0,0]
[{"$f":"'O2'!E12","v":0},0,0]
[{"$f":"'O2'!E13","v":0},0,0]
[{"$f":"'O2'!E14","v":0},0,0]
[{"$f":"'O2'!E15","v":0},0,0]
[{"$f":"'O2'!E16","v":0},0,0]
[{"$f":"'O2'!E17","v":0},0,0]
[{"$f":"'O2'!E18","v":0},0,0]
[{"$f":"'O2'!E19","v":0},0,0]
[{"$f":"'O2'!E20","v":0},0,0]
[{"$f":"'O2'!E21","v":0},0,0]
[{"$f":"'O2'!E9","v":0},0,0]
[{"$f":"'O2'!F10","v":0},0,0]
[{"$f":"'O2'!F11","v":0},0,0]
[{"$f":"'O2'!F12","v":0},0,0]
[{"$f":"'O2'!F13","v":0},0,0]
[{"$f":"'O2'!F14","v":0},0,0]
[{"$f":"'O2'!F15","v":0},0,0]
[{"$f":"'O2'!F16","v":0},0,0]
[{"$f":"'O2'!F17","v":0},0,0]
[{"$f":"'O2'!F18","v":0},0,0]
[{"$f":"'O2'!F19","v":0},0,0]
[{"$f":"'O2'!F20","v":0},0,0]
[{"$f":"'O2'!F21","v":0},0,0]
[{"$f":"'O2'!F9","v":0},0,0]
[{"$f":"'O2'!G10","v":0},0,0]
[{"$f":"'O2'!G11","v":0},0,0]
[{"$f":"'O2'!G12","v":0},0,0]
[{"$f":"'O2'!G13","v":0},0,0]
[{"$f":"'O2'!G14","v":0},0,0]
[{"$f":"'O2'!G15","v":0},0,0]
[{"$f":"'O2'!G16","v":0},0,0]
[{"$f":"'O2'!G18","v":0},0,0]
[{"$f":"'O2'!G19","v":0},0,0]
[{"$f":"'O2'!G20","v":0},0,0]
[{"$f":"'O2'!G21","v":0},0,0]
[{"$f":"'O2'!G9","v":0},0,{"$f":"A5096*B5096","v":0}]
[{"$f":"'O2'!H10","v":0},0,0]
[{"$f":"'O2'!H11","v":0},0,0]
[{"$f":"'O2'!H12","v":0},0,0]
[{"$f":"'O2'!H13","v":0},0,0]
[{"$f":"'O2'!H14","v":0},0,0]
[{"$f":"'O2'!H15","v":0},0,0]
[{"$f":"'O2'!H16","v":0},0,0]
[{"$f":"'O2'!H18","v":0},0,0]
[{"$f":"'O2'!H19","v":0},0,0]
[{"$f":"'O2'!H20","v":0},0,0]
[{"$f":"'O2'!H21","v":0},0,0]
[{"$f":"'O2'!H9","v":0},0,0]
[{"$f":"'O2'!I10","v":0},0,0]
[{"$f":"'O2'!I11","v":0},0,0]
[{"$f":"'O2'!I12","v":0},0,0]
[{"$f":"'O2'!I13","v":0},0,0]
[{"$f":"'O2'!I14","v":0},0,0]
[{"$f":"'O2'!I15","v":0},0,0]
[{"$f":"'O2'!I16","v":0},0,0]
[{"$f":"'O2'!I18","v":0},0,0]
[{"$f":"'O2'!I19","v":0},0,0]
[{"$f":"'O2'!I20","v":0},0,0]
[{"$f":"'O2'!I21","v":0},0,0]
[{"$f":"'O2'!I9","v":0},0,0]
[{"$f":"'O2'!J10","v":0},0,0]
[{"$f":"'O2'!J11","v":0},0,0]
[{"$f":"'O2'!J12","v":0},0,0]
[{"$f":"'O2'!J13","v":0},0,0]
[{"$f":"'O2'!J14","v":0},0,0]
[{"$f":"'O2'!J15","v":0},0,0]
[{"$f":"'O2'!J16","v":0},0,0]
[{"$f":"'O2'!J18","v":0},0,0]
[{"$f":"'O2'!J19","v":0},0,0]
[{"$f":"'O2'!J20","v":0},0,0]
[{"$f":"'O2'!J21","v":0},0,0]
[{"$f":"'O2'!J9","v":0},0,0]
[{"$f":"'O2'!K10","v":0},0,0]
[{"$f":"'O2'!K11","v":0},0,0]
[{"$f":"'O2'!K12","v":0},0,0]
[{"$f":"'O2'!K13","v":0},0,0]
[{"$f":"'O2'!K14","v":0},0,0]
[{"$f":"'O2'!K15","v":0},0,0]
[{"$f":"'O2'!K16","v":0},0,0]
[{"$f":"'O2'!K17","v":0},0,0]
[{"$f":"'O2'!K18","v":0},0,0]
[{"$f":"'O2'!K19","v":0},0,0]
[{"$f":"'O2'!K20","v":0},0,0]
[{"$f":"'O2'!K21","v":0},0,0]
[{"$f":"'O2'!K9","v":0},0,0]
[{"$f":"'O2'!L10","v":0},0,0]
[{"$f":"'O2'!L11","v":0},0,0]
[{"$f":"'O2'!L12","v":0},0,0]
[{"$f":"'O2'!L13","v":0},0,0]
[{"$f":"'O2'!L14","v":0},0,0]
[{"$f":"'O2'!L15","v":0},0,0]
[{"$f":"'O2'!L16","v":0},0,0]
[{"$f":"'O2'!L17","v":0},0,0]
[{"$f":"'O2'!L18","v":0},0,0]
[{"$f":"'O2'!L19","v":0},0,0]
[{"$f":"'O2'!L20","v":0},0,0]
[{"$f":"'O2'!L21","v":0},0,0]
[{"$f":"'O2'!L9","v":0},0,0]
[{"$f":"'O3'!E10","v":0},0,0]
[{"$f":"'O3'!E11","v":0},0,{"$f":"A5160*B5160","v":0}]
[{"$f":"'O3'!E12","v":0},0,0]
[{"$f":"'O3'!E13","v":0},0,0]
[{"$f":"'O3'!E14","v":0},0,0]
[{"$f":"'O3'!E15","v":0},0,0]
[{"$f":"'O3'!E16","v":0},0,0]
[{"$f":"'O3'!E17","v":0},0,0]
[{"$f":"'O3'!E18","v":0},0,0]
[{"$f":"'O3'!E19","v":0},0,0]
[{"$f":"'O3'!E20","v":0},0,0]
[{"$f":"'O3'!E21","v":0},0,0]
[{"$f":"'O3'!E9","v":0},0,0]
[{"$f":"'O3'!F10","v":0},0,0]
[{"$f":"'O3'!F11","v":0},0,0]
[{"$f":"'O3'!F12","v":0},0,0]
[{"$f":"'O3'!F13","v":0},0,0]
[{"$f":"'O3'!F14","v":0},0,0]
[{"$f":"'O3'!F15","v":0},0,0]
[{"$f":"'O3'!F16","v":0},0,0]
[{"$f":"'O3'!F17","v":0},0,0]
[{"$f":"'O3'!F18","v":0},0,0]
[{"$f":"'O3'!F19","v":0},0,0]
[{"$f":"'O3'!F20","v":0},0,0]
[{"$f":"'O3'!F21","v":0},0,0]
[{"$f":"'O3'!F9","v":0},0,0]
[{"$f":"'O3'!G10","v":0},0,0]
[{"$f":"'O3'!G11","v":0},0,0]
[{"$f":"'O3'!G12","v":0},0,0]
[{"$f":"'O3'!G13","v":0},0,0]
[{"$f":"'O3'!G14","v":0},0,0]
[{"$f":"'O3'!G15","v":0},0,0]
[{"$f":"'O3'!G16","v":0},0,0]
[{"$f":"'O3'!G18","v":0},0,0]
[{"$f":"'O3'!G19","v":0},0,0]
[{"$f":"'O3'!G20","v":0},0,0]
[{"$f":"'O3'!G21","v":0},0,0]
[{"$f":"'O3'!G9","v":0},0,0]
[{"$f":"'O3'!H10","v":0},0,0]
[{"$f":"'O3'!H11","v":0},0,0]
[{"$f":"'O3'!H12","v":0},0,0]
[{"$f":"'O3'!H13","v":0},0,0]
[{"$f":"'O3'!H14","v":0},0,0]
[{"$f":"'O3'!H15","v":0},0,0]
[{"$f":"'O3'!H16","v":0},0,0]
[{"$f":"'O3'!H18","v":0},0,0]
[{"$f":"'O3'!H19","v":0},0,0]
[{"$f":"'O3'!H20","v":0},0,0]
[{"$f":"'O3'!H21","v":0},0,0]
[{"$f":"'O3'!H9","v":0},0,0]
[{"$f":"'O3'!I10","v":0},0,0]
[{"$f":"'O3'!I11","v":0},0,0]
[{"$f":"'O3'!I12","v":0},0,0]
[{"$f":"'O3'!I13","v":0},0,0]
[{"$f":"'O3'!I14","v":0},0,0]
[{"$f":"'O3'!I15","v":0},0,0]
[{"$f":"'O3'!I16","v":0},0,0]
[{"$f":"'O3'!I18","v":0},0,0]
[{"$f":"'O3'!I19","v":0},0,0]
[{"$f":"'O3'!I20","v":0},0,0]
[{"$f":"'O3'!I21","v":0},0,0]
[{"$f":"'O3'!I9","v":0},0,0]
[{"$f":"'O3'!J10","v":0},0,0]
[{"$f":"'O3'!J11","v":0},0,0]
[{"$f":"'O3'!J12","v":0},0,0]
[{"$f":"'O3'!J13","v":0},0,{"$f":"A5224*B5224","v":0}]
[{"$f":"'O3'!J14","v":0},0,0]
[{"$f":"'O3'!J15","v":0},0,0]
[{"$f":"'O3'!J16","v":0},0,0]
[{"$f":"'O3'!J18","v":0},0,0]
[{"$f":"'O3'!J19","v":0},0,0]
[{"$f":"'O3'!J20","v":0},0,0]
[{"$f":"'O3'!J21","v":0},0,0]
[{"$f":"'O3'!J9","v":0},0,0]
[{"$f":"'O3'!K10","v":0},0,0]
[{"$f":"'O3'!K11","v":0},0,0]
[{"$f":"'O3'!K12","v":0},0,0]
[{"$f":"'O3'!K13","v":0},0,0]
[{"$f":"'O3'!K14","v":0},0,0]
[{"$f":"'O3'!K15","v":0},0,0]
[{"$f":"'O3'!K16","v":0},0,0]
[{"$f":"'O3'!K17","v":0},0,0]
[{"$f":"'O3'!K18","v":0},0,0]
[{"$f":"'O3'!K19","v":0},0,0]
[{"$f":"'O3'!K20","v":0},0,0]
[{"$f":"'O3'!K21","v":0},0,0]
[{"$f":"'O3'!K9","v":0},0,0]
[{"$f":"'O3'!L10","v":0},0,0]
[{"$f":"'O3'!L11","v":0},0,0]
[{"$f":"'O3'!L12","v":0},0,0]
[{"$f":"'O3'!L13","v":0},0,0]
[{"$f":"'O3'!L14","v":0},0,0]
[{"$f":"'O3'!L15","v":0},0,0]
[{"$f":"'O3'!L16","v":0},0,0]
[{"$f":"'O3'!L17","v":0},0,0]
[{"$f":"'O3'!L18","v":0},0,0]
[{"$f":"'O3'!L19","v":0},0,0]
[{"$f":"'O3'!L20","v":0},0,0]
[{"$f":"'O3'!L21","v":0},0,0]
[{"$f":"'O3'!L9","v":0},0,0]
[{"$f":"'O4'!E10","v":0},0,0]
[{"$f":"'O4'!E11","v":0},0,0]
[{"$f":"'O4'!E12","v":0},0,0]
[{"$f":"'O4'!E13","v":0},0,0]
[{"$f":"'O4'!E14","v":0},0,0]
[{"$f":"'O4'!E15","v":0},0,0]
[{"$f":"'O4'!E16","v":0},0,0]
[{"$f":"'O4'!E17","v":0},0,0]
[{"$f":"'O4'!E18","v":0},0,0]
[{"$f":"'O4'!E19","v":0},0,0]
[{"$f":"'O4'!E20","v":0},0,0]
[{"$f":"'O4'!E21","v":0},0,0]
[{"$f":"'O4'!E9","v":0},0,0]
[{"$f":"'O4'!F10","v":0},0,0]
[{"$f":"'O4'!F11","v":0},0,0]
[{"$f":"'O4'!F12","v":0},0,0]
[{"$f":"'O4'!F13","v":0},0,0]
[{"$f":"'O4'!F14","v":0},0,0]
[{"$f":"'O4'!F15","v":0},0,0]
[{"$f":"'O4'!F16","v":0},0,0]
[{"$f":"'O4'!F17","v":0},0,0]
[{"$f":"'O4'!F18","v":0},0,0]
[{"$f":"'O4'!F19","v":0},0,0]
[{"$f":"'O4'!F20","v":0},0,0]
[{"$f":"'O4'!F21","v":0},0,0]
[{"$f":"'O4'!F9","v":0},0,0]
[{"$f":"'O4'!G10","v":0},0,0]
[{"$f":"'O4'!G11","v":0},0,0]
[{"$f":"'O4'!G12","v":0},0,0]
[{"$f":"'O4'!G13","v":0},0,{"$f":"A5288*B5288","v":0}]
[{"$f":"'O4'!G14","v":0},0,0]
[{"$f":"'O4'!G15","v":0},0,0]
[{"$f":"'O4'!G16","v":0},0,0]
[{"$f":"'O4'!G18","v":0},0,0]
[{"$f":"'O4'!G19","v":0},0,0]
[{"$f":"'O4'!G20","v":0},0,0]
[{"$f":"'O4'!G21","v":0},0,0]
[{"$f":"'O4'!G9","v":0},0,0]
[{"$f":"'O4'!H10","v":0},0,0]
[{"$f":"'O4'!H11","v":0},0,0]
[{"$f":"'O4'!H12","v":0},0,0]
[{"$f":"'O4'!H13","v":0},0,0]
[{"$f":"'O4'!H14","v":0},0,0]
[{"$f":"'O4'!H15","v":0},0,0]
[{"$f":"'O4'!H16","v":0},0,0]
[{"$f":"'O4'!H18","v":0},0,0]
[{"$f":"'O4'!H19","v":0},0,0]
[{"$f":"'O4'!H20","v":0},0,0]
[{"$f":"'O4'!H21","v":0},0,0]
[{"$f":"'O4'!H9","v":0},0,0]
[{"$f":"'O4'!I10","v":0},0,0]
[{"$f":"'O4'!I11","v":0},0,0]
[{"$f":"'O4'!I12","v":0},0,0]
[{"$f":"'O4'!I13","v":0},0,0]
[{"$f":"'O4'!I14","v":0},0,0]
[{"$f":"'O4'!I15","v":0},0,0]
[{"$f":"'O4'!I16","v":0},0,0]
[{"$f":"'O4'!I18","v":0},0,0]
[{"$f":"'O4'!I19","v":0},0,0]
[{"$f":"'O4'!I20","v":0},0,0]
[{"$f":"'O4'!I21","v":0},0,0]
[{"$f":"'O4'!I9","v":0},0,0]
[{"$f":"'O4'!J10","v":0},0,0]
[{"$f":"'O4'!J11","v":0},0,0]
[{"$f":"'O4'!J12","v":0},0,0]
[{"$f":"'O4'!J13","v":0},0,0]
[{"$f":"'O4'!J14","v":0},0,0]
[{"$f":"'O4'!J15","v":0},0,0]
[{"$f":"'O4'!J16","v":0},0,0]
[{"$f":"'O4'!J18","v":0},0,0]
[{"$f":"'O4'!J19","v":0},0,0]
[{"$f":"'O4'!J20","v":0},0,0]
[{"$f":"'O4'!J21","v":0},0,0]
[{"$f":"'O4'!J9","v":0},0,0]
[{"$f":"'O4'!K10","v":0},0,0]
[{"$f":"'O4'!K11","v":0},0,0]
[{"$f":"'O4'!K12","v":0},0,0]
[{"$f":"'O4'!K13","v":0},0,0]
[{"$f":"'O4'!K14","v":0},0,0]
[{"$f":"'O4'!K15","v":0},0,0]
[{"$f":"'O4'!K16","v":0},0,0]
[{"$f":"'O4'!K17","v":0},0,0]
[{"$f":"'O4'!K18","v":0},0,0]
[{"$f":"'O4'!K19","v":0},0,0]
[{"$f":"'O4'!K20","v":0},0,0]
[{"$f":"'O4'!K21","v":0},0,0]
[{"$f":"'O4'!K9","v":0},0,0]
[{"$f":"'O4'!L10","v":0},0,0]
[{"$f":"'O4'!L11","v":0},0,0]
[{"$f":"'O4'!L12","v":0},0,0]
[{"$f":"'O4'!L13","v":0},0,0]
[{"$f":"'O4'!L14","v":0},0,0]
[{"$f":"'O4'!L15","v":0},0,0]
[{"$f":"'O4'!L16","v":0},0,{"$f":"A5352*B5352","v":0}]
[{"$f":"'O4'!L17","v":0},0,0]
[{"$f":"'O4'!L18","v":0},0,0]
[{"$f":"'O4'!L19","v":0},0,0]
[{"$f":"'O4'!L20","v":0},0,0]
[{"$f":"'O4'!L21","v":0},0,0]
[{"$f":"'O4'!L9","v":0},0,0]
[{"$f":"'S1'!D10","v":0},0,0]
[{"$f":"'S1'!D11","v":0},0,0]
[{"$f":"'S1'!D12","v":0},0,0]
[{"$f":"'S1'!D13","v":0},0,0]
[{"$f":"'S1'!D14","v":0},0,0]
[{"$f":"'S1'!D15","v":0},0,0]
[{"$f":"'S1'!D16","v":0},0,0]
[{"$f":"'S1'!D17","v":0},0,0]
[{"$f":"'S1'!D18","v":0},0,0]
[{"$f":"'S1'!D19","v":0},0,0]
[{"$f":"'S1'!D20","v":0},0,0]
[{"$f":"'S1'!D21","v":0},0,0]
[{"$f":"'S1'!D9","v":0},0,0]
[{"$f":"'S1'!E10","v":0},0,0]
[{"$f":"'S1'!E11","v":0},0,0]
[{"$f":"'S1'!E12","v":0},0,0]
[{"$f":"'S1'!E13","v":0},0,0]
[{"$f":"'S1'!E14","v":0},0,0]
[{"$f":"'S1'!E15","v":0},0,0]
[{"$f":"'S1'!E16","v":0},0,0]
[{"$f":"'S1'!E17","v":0},0,0]
[{"$f":"'S1'!E18","v":0},0,0]
[{"$f":"'S1'!E19","v":0},0,0]
[{"$f":"'S1'!E20","v":0},0,0]
[{"$f":"'S1'!E21","v":0},0,0]
[{"$f":"'S1'!E9","v":0},0,0]
[{"$f":"'S1'!F10","v":0},0,0]
[{"$f":"'S1'!F11","v":0},0,0]
[{"$f":"'S1'!F12","v":0},0,0]
[{"$f":"'S1'!F13","v":0},0,0]
[{"$f":"'S1'!F14","v":0},0,0]
[{"$f":"'S1'!F15","v":0},0,0]
[{"$f":"'S1'!F16","v":0},0,0]
[{"$f":"'S1'!F17","v":0},0,0]
[{"$f":"'S1'!F18","v":0},0,0]
[{"$f":"'S1'!F19","v":0},0,0]
[{"$f":"'S1'!F20","v":0},0,0]
[{"$f":"'S1'!F21","v":0},0,0]
[{"$f":"'S1'!F9","v":0},0,0]
[{"$f":"'S1'!G10","v":0},0,0]
[{"$f":"'S1'!G11","v":0},0,0]
[{"$f":"'S1'!G12","v":0},0,0]
[{"$f":"'S1'!G13","v":0},0,0]
[{"$f":"'S1'!G14","v":0},0,0]
[{"$f":"'S1'!G18","v":0},0,0]
[{"$f":"'S1'!G19","v":0},0,0]
[{"$f":"'S1'!G20","v":0},0,0]
[{"$f":"'S1'!G21","v":0},0,0]
[{"$f":"'S1'!G9","v":0},0,0]
[{"$f":"'S1'!H19","v":0},0,0]
[{"$f":"'S1'!I10","v":0},0,0]
[{"$f":"'S1'!I11","v":0},0,0]
[{"$f":"'S1'!I12","v":0},0,0]
[{"$f":"'S1'!I13","v":0},0,0]
[{"$f":"'S1'!I14","v":0},0,0]
[{"$f":"'S1'!I15","v":0},0,0]
[{"$f":"'S1'!I16","v":0},0,0]
[{"$f":"'S1'!I17","v":0},0,{"$f":"A5416*B5416","v":0}]
[{"$f":"'S1'!I18","v":0},0,0]
[{"$f":"'S1'!I19","v":0},0,0]
[{"$f":"'S1'!I20","v":0},0,0]
[{"$f":"'S1'!I21","v":0},0,0]
[{"$f":"'S1'!I9","v":0},0,0]
[{"$f":"'S1'!J10","v":0},0,0]
[{"$f":"'S1'!J11","v":0},0,0]
[{"$f":"'S1'!J12","v":0},0,0]
[{"$f":"'S1'!J13","v":0},0,0]
[{"$f":"'S1'!J14","v":0},0,0]
[{"$f":"'S1'!J15","v":0},0,0]
[{"$f":"'S1'!J16","v":0},0,0]
[{"$f":"'S1'!J17","v":0},0,0]
[{"$f":"'S1'!J18","v":0},0,0]
[{"$f":"'S1'!J19","v":0},0,0]
[{"$f":"'S1'!J20","v":0},0,0]
[{"$f":"'S1'!J21","v":0},0,0]
[{"$f":"'S1'!J9","v":0},0,0]
[{"$f":"'S1'!K10","v":0},0,0]
[{"$f":"'S1'!K11","v":0},0,0]
[{"$f":"'S1'!K12","v":0},0,0]
[{"$f":"'S1'!K13","v":0},0,0]
[{"$f":"'S1'!K14","v":0},0,0]
[{"$f":"'S1'!K15","v":0},0,0]
[{"$f":"'S1'!K16","v":0},0,0]
[{"$f":"'S1'!K17","v":0},0,0]
[{"$f":"'S1'!K18","v":0},0,0]
[{"$f":"'S1'!K19","v":0},0,0]
[{"$f":"'S1'!K20","v":0},0,0]
[{"$f":"'S1'!K21","v":0},0,0]
[{"$f":"'S1'!K9","v":0},0,0]
[{"$f":"'S1'!L10","v":0},0,0]
[{"$f":"'S1'!L11","v":0},0,0]
[{"$f":"'S1'!L12","v":0},0,0]
[{"$f":"'S1'!L13","v":0},0,0]
[{"$f":"'S1'!L14","v":0},0,0]
[{"$f":"'S1'!L18","v":0},0,0]
[{"$f":"'S1'!L19","v":0},0,0]
[{"$f":"'S1'!L20","v":0},0,0]
[{"$f":"'S1'!L21","v":0},0,0]
[{"$f":"'S1'!L9","v":0},0,0]
[{"$f":"'S1'!M19","v":0},0,0]
[{"$f":"'S1'!N10","v":0},0,0]
[{"$f":"'S1'!N11","v":0},0,0]
[{"$f":"'S1'!N12","v":0},0,0]
[{"$f":"'S1'!N13","v":0},0,0]
[{"$f":"'S1'!N14","v":0},0,0]
[{"$f":"'S1'!N15","v":0},0,0]
[{"$f":"'S1'!N16","v":0},0,0]
[{"$f":"'S1'!N17","v":0},0,0]
[{"$f":"'S1'!N18","v":0},0,0]
[{"$f":"'S1'!N19","v":0},0,0]
[{"$f":"'S1'!N20","v":0},0,0]
[{"$f":"'S1'!N21","v":0},0,0]
[{"$f":"'S1'!N9","v":0},0,0]
[{"$f":"'S1'!O10","v":0},0,0]
[{"$f":"'S1'!O11","v":0},0,0]
[{"$f":"'S1'!O12","v":0},0,0]
[{"$f":"'S1'!O13","v":0},0,0]
[{"$f":"'S1'!O14","v":0},0,0]
[{"$f":"'S1'!O15","v":0},0,0]
[{"$f":"'S1'!O16","v":0},0,0]
[{"$f":"'S1'!O17","v":0},0,0]
[{"$f":"'S1'!O18","v":0},0,{"$f":"A5480*B5480","v":0}]
[{"$f":"'S1'!O19","v":0},0,0]
[{"$f":"'S1'!O20","v":0},0,0]
[{"$f":"'S1'!O21","v":0},0,0]
[{"$f":"'S1'!O9","v":0},0,0]
[{"$f":"'S1'!P10","v":0},0,0]
[{"$f":"'S1'!P11","v":0},0,0]
[{"$f":"'S1'!P12","v":0},0,0]
[{"$f":"'S1'!P13","v":0},0,0]
[{"$f":"'S1'!P14","v":0},0,0]
[{"$f":"'S1'!P15","v":0},0,0]
[{"$f":"'S1'!P16","v":0},0,0]
[{"$f":"'S1'!P17","v":0},0,0]
[{"$f":"'S1'!P18","v":0},0,0]
[{"$f":"'S1'!P19","v":0},0,0]
[{"$f":"'S1'!P20","v":0},0,0]
[{"$f":"'S1'!P21","v":0},0,0]
[{"$f":"'S1'!P9","v":0},0,0]
[{"$f":"'S1'!Q10","v":0},0,0]
[{"$f":"'S1'!Q11","v":0},0,0]
[{"$f":"'S1'!Q12","v":0},0,0]
[{"$f":"'S1'!Q13","v":0},0,0]
[{"$f":"'S1'!Q14","v":0},0,0]
[{"$f":"'S1'!Q18","v":0},0,0]
[{"$f":"'S1'!Q19","v":0},0,0]
[{"$f":"'S1'!Q20","v":0},0,0]
[{"$f":"'S1'!Q21","v":0},0,0]
[{"$f":"'S1'!Q9","v":0},0,0]
[{"$f":"'S1'!R19","v":0},0,0]

{"sheet":"KONTROLY","index":1,"n_rows":121,"n_cols":12,"rows_kept":121,"cut":false,"hidden":false,"merged":[[111,0,113,0],[116,0,116,1],[117,0,119,0],[96,0,98,0],[100,0,100,1],[101,0,103,0],[105,0,105,1],[106,0,108,0],[110,0,110,1]]}
["Jazyk výkazu","CZ","Verze výkazu","2.72","RETAIL (pokud je to retailový výkaz napiš do F1 písmeno R) pole je ovládáno skriptem","","Verze výkazu výstup",{"$f":"IF($B$1=\"E\",D1&F1&B1,D1&F1)","v":"2.72"},null,"Jazyky (combo)","CZ","E"]
[]
["Kontroly ÚVOD","Podmínka","Výstupní hláška","Výstup podmínka","Hláška CZ","Hláška EN","Číslo chyby","popis chyby"]
["Kontrola kvartálu",{"$f":"ISNUMBER(Úvod!D4)","v":true},{"$f":"IF(B4=TRUE,\"\",IF($B$1=\"CZ\",E4,F4))","v":""},{"$f":"IF(C4=\"\",0,1)","v":0},"Čtvrtletí (musí být číslo 1, 2, 3 nebo 4)","Quarter (please fill in 1,2,3, or 4)",1,{"$f":"\"Error #\"&G4&\": List ÚVOD - \"","v":"Error #1: List ÚVOD - "}]
["Kontrola IČO",{"$f":"LEN(Úvod!C12)","v":0},null,{"$f":"IF(C5=\"\",0,1)","v":0}," IČO (musí mít osm číslic)"," IČO (the number must have 8 figures)",2,{"$f":"\"Error #\"&G5&\": List ÚVOD - \"","v":"Error #2: List ÚVOD - "}]
["EKOKOM-ID",{"$f":"LEN(Úvod!F14)","v":0},{"$f":"IF(B6=9,\"\",IF($B$1=\"CZ\",E6,F6))","v":" EKOKOM ID (musí začínat jedním písmenem a jeho délka musí být 9 znaků)"},{"$f":"IF(B6=9,0,1)","v":1}," EKOKOM ID (musí začínat jedním písmenem a jeho délka musí být 9 znaků)"," EKOKOM ID (ID must start with one letter and it must have 9 characters)",3,"Error #3: List ÚVOD - "]
["Kontrola úvod - chybová hláška 1",null,{"$f":"IF(D7=0,\"\",IF($B$1=\"CZ\",E7,F7))","v":"POZOR!!  Zkontrolujte prosím následující pole na této stránce:"},{"$f":"SUM(D4:D6)","v":1},"POZOR!!  Zkontrolujte prosím následující pole na této stránce:","ATTENTION!! Please check the following fields on this page:"]
["Kontrola úvod - chybová hláška 2",null,{"$f":"C4&C5&C6","v":" EKOKOM ID (musí začínat jedním písmenem a jeho délka musí být 9 znaků)"}]
["Kontrola úvod - chybová hláška složená 1,2",null,{"$f":"C7&C8","v":"POZOR!!  Zkontrolujte prosím následující pole na této stránce: EKOKOM ID (musí začínat jedním písmenem a jeho délka musí být 9 znaků)"}]
[]
["Kontola Čísel na listech","hodnota","Výstupní hláška (chyba na listu)","číslo chyby","popis chyby","Vyplněné listy"]
["J1-1A",{"$f":"'J1-1A'!R1","v":0},{"$f":"IF(ISERR(B12),IF($B$1=\"CZ\",E12&$E$39&A12,E12&$F$39&A12),\"\")","v":""},10,{"$f":"\"Error #\"&D12&\": \"","v":"Error #10: "},{"$f":"SUM(J11A_HODNOTY)","v":0},{"$f":"IF(F12>0,A12,\"\")","v":""}]
["J1-1B",{"$f":"'J1-1B'!V1","v":0},"",11,{"$f":"\"Error #\"&D13&\": \"","v":"Error #11: "},{"$f":"SUM(J11B_HODNOTY)","v":0},{"$f":"IF(F13>0,\" | \"&A13,\"\")","v":""}]
["J1-1K",{"$f":"'J1-1K'!P1","v":0},"",12,"Error #12: ",{"$f":"SUM(J11K_HODNOTY)","v":0},{"$f":"IF(F14>0,\" | \"&A14,\"\")","v":""}]
["J1-2A",{"$f":"'J1-2A'!R1","v":0},"",13,"Error #13: ",{"$f":"SUM(J12A_HODNOTY)","v":0},""]
["J1-2B",{"$f":"'J1-2B'!V1","v":0},"",14,"Error #14: ",{"$f":"SUM(J12B_HODNOTY)","v":0},""]
["J1-2K",{"$f":"'J1-2K'!P1","v":0},"",15,"Error #15: ",{"$f":"SUM(J12K_HODNOTY)","v":0},""]
["J1-3",{"$f":"'J1-3'!V1","v":0},"",16,"Error #16: ",{"$f":"SUM(J13_HODNOTY)","v":0},""]
["J1-3K",{"$f":"'J1-3K'!R1","v":0},"",17,"Error #17: ",{"$f":"SUM(J13K_HODNOTY)","v":0},""]
["J2",{"$f":"'J2'!N1","v":0},"",18,"Error #18: ",{"$f":"SUM(J2_HODNOTY)","v":0},""]
["J3",{"$f":"'J3'!N1","v":0},"",19,"Error #19: ",{"$f":"SUM(J3_HODNOTY)","v":0},""]
["J4",{"$f":"'J4'!N1","v":0},"",20,"Error #20: ",{"$f":"SUM(J4_HODNOTY)","v":0},""]
["L",{"$f":"L!L1","v":0},"",21,"Error #21: ",{"$f":"SUM(L_HODNOTY)","v":0},""]
["O1-1A",{"$f":"'O1-1A'!R1","v":0},"",22,"Error #22: ",{"$f":"SUM(O11A_HODNOTY)","v":0},""]
["O1-1B",{"$f":"'O1-1B'!V1","v":0},"",23,"Error #23: ",{"$f":"SUM(O11B_HODNOTY)","v":0},""]
["O1-1K",{"$f":"'O1-1K'!P1","v":0},"",24,"Error #24: ",{"$f":"SUM(O11K_HODNOTY)","v":0},""]
["O1-2A",{"$f":"'O1-2A'!R1","v":0},"",25,"Error #25: ",{"$f":"SUM(O12A_HODNOTY)","v":0},""]
["O1-2B",{"$f":"'O1-2B'!V1","v":0},"",26,"Error #26: ",{"$f":"SUM(O12B_HODNOTY)","v":0},""]
["O1-2K",{"$f":"'O1-2K'!P1","v":0},"",27,"Error #27: ",{"$f":"SUM(O12K_HODNOTY)","v":0},""]
["O1-3",{"$f":"'O1-3'!V1","v":0},"",28,"Error #28: ",{"$f":"SUM(O13_HODNOTY)","v":0},""]
["O1-3K",{"$f":"'O1-3K'!R1","v":0},"",29,"Error #29: ",{"$f":"SUM(O13K_HODNOTY)","v":0},""]
["O2",{"$f":"'O2'!N1","v":0},"",30,"Error #30: ",{"$f":"SUM(O2_HODNOTY)","v":0},""]
["O3",{"$f":"'O3'!N1","v":0},"",31,"Error #31: ",{"$f":"SUM(O3_HODNOTY)","v":0},""]
["O4",{"$f":"'O4'!N1","v":0},"",32,"Error #32: ",{"$f":"SUM(O4_HODNOTY)","v":0},""]
["S1",{"$f":"'S1'!T1","v":0},"",33,"Error #33: ",{"$f":"SUM(S1_HODNOTY)","v":0},""]
["S2",{"$f":"'S2'!Q1","v":0},"",34,"Error #34: ",{"$f":"SUM(S2_HODNOTY)","v":0},""]
[]
["Hlášky kontrol na listech - souhrn","hodnota","Výstupní hláška - souhrn",null,"Hláška CZ (šablona)","Hláška EN (šablona)"]
[null,{"$f":"B12*B13*B14*B15*B16*B17*B18*B19*B20*B21*B22*B23*B24*B25*B26*B27*B28*B29*B30*B31*B32*B33*B34*B35*B36","v":0},{"$f":"C12&C13&C14&C15&C16&C17&C18&C19&C20&C21&C22&C23&C24&C25&C26&C27&C28&C29&C30&C31&C32&C33&C34&C35&C36","v":""},null,{"$f":"\"Chybná hodnota na záložce: \"","v":"Chybná hodnota na záložce: "},"Error value in sheet:"]
[null,null,{"$f":"IF($B$1=\"CZ\",E40&G12&G13&G14&G15&G16&G17&G18&G19&G20&G21&G22&G23&G24&G25&G26&G27&G28&G29&G30&G31&G32&G33&G34&G35&G36,F40&G12&G13&G14&G15&G16&G17&G18&G19&G20&G21&G22&G23&G24&G25&G26&G27&G28&G29&G30&G31&G32&G33&G34&G35&G36)","v":"VYPLNILI JSTE TYTO LISTY: "},null,"VYPLNILI JSTE TYTO LISTY: ","YOU COMPLETED THESE SHEETS: "]
[]
["Kontola KOMPOZITY SOUČET 1","hodnota","Kontrola KOMPOZITY SOUČET 2","hodnota","Výstupní hláška","Rozdíl","Hláška CZ","Hláška EN","číslo chyby","popis chyby"]
["Suma hodnot v červených polích na listu J1-1A",{"$f":"SUM(J11A_KOMPOZITY_CERVENE)","v":0},"Suma hodnot v červených polích na listu J1-1K",{"$f":"SUM(J11K_KOMPOZITY_CERVENE)","v":0},{"$f":"IF(F43<>0,IF($B$1=\"CZ\",J43&G43&\" \",J43&H43&\" \"),\"\")","v":""},{"$f":"B43-D43","v":0},"Chyba vyplnění na listech J1-1A a J1-1K: Součet hmotnosti kompozitních obalů na listu J1-1A ve sloupci vyrobené, nakoupené v ČR a jejich hmotnostního rozpadu na listu J1-1K ve sloupci prodejní vyrobené, nakoupené v ČR, musí být roven","Fill error on sheets J1-1A and J1-1K: The sum of the weights of composite packaging on sheet J1-1A in the column produced, bought in Czechia and their mass decay on sheet J1-1K in the column sales, produced, bought in Czechia, must be equal \nCzechia, must be equal ",100,{"$f":"\"Error #\"&I43&\": \"","v":"Error #100: "}]
["Suma hodnot v oranžových polích na listu J1-1A",{"$f":"SUM(J11A_KOMPOZITY_ORANZOVE)","v":0},"Suma hodnot v oranžových polích na listu J1-1K",{"$f":"SUM(J11K_KOMPOZITY_ORANZOVE)","v":0},{"$f":"IF(F44<>0,IF($B$1=\"CZ\",J44&G44&\" \",J44&H44&\" \"),\"\")","v":""},0,"Chyba vyplnění na listech J1-1A a J1-1K: Součet hmotnosti kompozitních obalů na listu J1-1A ve sloupci importované do ČR a jejich hmotnostního rozpadu na listu J1-1K ve sloupci prodejní importované do ČR, musí být roven","Fill error on sheets J1-1A and J1-1K: The sum of the weights of composite packaging on sheet J1-1A in the column imported to Czechia and their mass decay on sheet J1-1K in the column sales, imported to Czechia, must be equal",101,{"$f":"\"Error #\"&I44&\": \"","v":"Error #101: "}]
["Suma hodnot v modrých polích na listu J1-1B",{"$f":"SUM(J11B_KOMPOZITY_MODRE)","v":0},"Suma hodnot v modrých polích na listu J1-1K",{"$f":"SUM(J11K_KOMPOZITY_MODRE)","v":0},"",0,"Chyba vyplnění na listech J1-1B a J1-1K: Součet hmotnosti kompozitních obalů na listu J1-1B ve sloupci vyrobené, nakoupené v ČR a jejich hmotnostního rozpadu na listu J1-1K ve sloupci skupinové vyrobené, nakoupené v ČR, musí být roven","Fill error on sheets J1-1B and J1-1K: The sum of the weights of composite packaging on sheet J1-1B in the column produced, bought in Czechia and their mass decay on sheet J1-1K in the column group, produced, bought in Czechia, must be equal",102,"Error #102: "]
["Suma hodnot ve žlutých polích na listu J1-1B",{"$f":"SUM(J11B_KOMPOZITY_ZLUTE)","v":0},"Suma hodnot ve žlutých polích na listu J1-1K",{"$f":"SUM(J11K_KOMPOZITY_ZLUTE)","v":0},"",0,"Chyba vyplnění na listech J1-1B a J1-1K: Součet hmotnosti kompozitních obalů na listu J1-1B ve sloupci importované do ČR a jejich hmotnostního rozpadu na listu J1-1K ve sloupci skupinové importované do ČR, musí být roven","Fill error on sheets J1-1B and J1-1K: The sum of the weights of composite packaging on sheet J1-1B in the column imported to Czechia and their mass decay on sheet J1-1K in the column group, imported to Czechia, must be equal",103,"Error #103: "]
["Suma hodnot v zelených polích na listu J1-1B",{"$f":"SUM(J11B_KOMPOZITY_ZELENE)","v":0},"Suma hodnot v zelených polích na listu J1-1K",{"$f":"SUM(J11K_KOMPOZITY_ZELENE)","v":0},"",0,"Chyba vyplnění na listech J1-1B a J1-1K: Součet hmotnosti kompozitních obalů na listu J1-1B ve sloupci vyrobené, nakoupené v ČR a jejich hmotnostního rozpadu na listu J1-1K ve sloupci přepravní vyrobené, nakoupené v ČR, musí být roven","Fill error on sheets J1-1B and J1-1K: The sum of the weights of composite packaging on sheet J1-1B in the column produced, bought in Czechia and their mass decay on sheet J1-1K in the column transport, produced, bought in Czechia, must be equal",104,"Error #104: "]
["Suma hodnot v šedých polích na listu J1-1B",{"$f":"SUM(J11B_KOMPOZITY_SEDE)","v":0},"Suma hodnot v šedých polích na listu J1-1K",{"$f":"SUM(J11K_KOMPOZITY_SEDE)","v":0},"",0,"Chyba vyplnění na listech J1-1B a J1-1K: Součet hmotnosti kompozitních obalů na listu J1-1B ve sloupci importované do ČR a jejich hmotnostního rozpadu na listu J1-1K ve sloupci přepravní importované do ČR, musí být roven","Fill error on sheets J1-1B and J1-1K: The sum of the weights of composite packaging on sheet J1-1B in the column imported to Czechia and their mass decay on sheet J1-1K in the column transport, imported to Czechia, must be equal",105,"Error #105: "]
["Suma hodnot v červených polích na listu J1-2A",{"$f":"SUM(J12A_KOMPOZITY_CERVENE)","v":0},"Suma hodnot v červených polích na listu J1-2K",{"$f":"SUM(J12K_KOMPOZITY_CERVENE)","v":0},"",0,"Chyba vyplnění na listech J1-2A a J1-2K: Součet hmotnosti kompozitních obalů na listu J1-2A ve sloupci vyrobené, nakoupené v ČR a jejich hmotnostního rozpadu na listu J1-2K ve sloupci prodejní vyrobené, nakoupené v ČR, musí být roven","Fill error on sheets J1-2A and J1-2K: The sum of the weights of composite packaging on sheet J1-2A in the column produced, bought in Czechia and their mass decay on sheet J1-2K in the column sales, produced,bought in Czechia, must be equal",106,"Error #106: "]
["Suma hodnot v oranžových polích na listu J1-2A",{"$f":"SUM(J12A_KOMPOZITY_ORANZOVE)","v":0},"Suma hodnot v oranžových polích na listu J1-2K",{"$f":"SUM(J12K_KOMPOZITY_ORANZOVE)","v":0},"",0,"Chyba vyplnění na listech J1-2A a J1-2K: Součet hmotnosti kompozitních obalů na listu J1-2A ve sloupci importované do ČR a jejich hmotnostního rozpadu na listu J1-2K ve sloupci prodejní importované do ČR, musí být roven","Fill error on sheets J1-2A and J1-2K: The sum of the weights of composite packaging on sheet J1-2A in the column imported to Czechia and their mass decay on sheet J1-2K in the column sales, imported to Czechia, must be equal",107,"Error #107: "]
["Suma hodnot v modrých polích na listu J1-2B",{"$f":"SUM(J12B_KOMPOZITY_MODRE)","v":0},"Suma hodnot v modrých polích na listu J1-2K",{"$f":"SUM(J12K_KOMPOZITY_MODRE)","v":0},"",0,"Chyba vyplnění na listech J1-2B a J1-2K: Součet hmotnosti kompozitních obalů na listu J1-2B ve sloupci vyrobené, nakoupené v ČR a jejich hmotnostního rozpadu na listu J1-2K ve sloupci skupinové vyrobené, nakoupené v ČR, musí být roven","Fill error on sheets J1-2B and J1-2K: The sum of the weights of composite packaging on sheet J1-2B in the column produced, bought in Czechia and their mass decay on sheet J1-2K in the column group, produced, bought in Czechia, must be equal",108,"Error #108: "]
["Suma hodnot ve žlutých polích na listu J1-2B",{"$f":"SUM(J12B_KOMPOZITY_ZLUTE)","v":0},"Suma hodnot ve žlutých polích na listu J1-2K",{"$f":"SUM(J12K_KOMPOZITY_ZLUTE)","v":0},"",0,"Chyba vyplnění na listech J1-2B a J1-2K: Součet hmotnosti kompozitních obalů na listu J1-2B ve sloupci importované do ČR a jejich hmotnostního rozpadu na listu J1-2Kve sloupci skupinové importované do ČR, musí být roven","Fill error on sheets J1-2B and J1-2K: The sum of the weights of composite packaging on sheet J1-2B in the column imported to Czechia and their mass decay on sheet J1-2K in the column group, imported to Czechia, must be equal",109,"Error #109: "]
["Suma hodnot v zelených polích na listu J1-2B",{"$f":"SUM(J12B_KOMPOZITY_ZELENE)","v":0},"Suma hodnot v zelených polích na listu J1-2K",{"$f":"SUM(J12K_KOMPOZITY_ZELENE)","v":0},"",0,"Chyba vyplnění na listech J1-2B a J1-2K: Součet hmotnosti kompozitních obalů na listu J1-2B ve sloupci vyrobené, nakoupené v ČR a jejich hmotnostního rozpadu na listu J1-2K ve sloupci přepravní vyrobené, nakoupené v ČR, musí být roven","Fill error on sheets J1-2B and J1-2K: The sum of the weights of composite packaging on sheet J1-2B in the column produced, bought in Czechia and their mass decay on sheet J1-2K in the column transport, produced, bought in Czechia, must be equal",110,"Error #110: "]
["Suma hodnot v šedých polích na listu J1-2B",{"$f":"SUM(J12B_KOMPOZITY_SEDE)","v":0},"Suma hodnot v šedých polích na listu J1-2K",{"$f":"SUM(J12K_KOMPOZITY_SEDE)","v":0},"",0,"Chyba vyplnění na listech J1-2B a J1-2K: Součet hmotnosti kompozitních obalů na listu J1-2B ve sloupci importované do ČR a jejich hmotnostního rozpadu na listu J1-2K ve sloupci přepravní importované do ČR, musí být roven","Fill error on sheets J1-2B and J1-2K: The sum of the weights of composite packaging on sheet J1-2B in the column imported to Czechia and their mass decay on sheet J1-2K in the column transport, imported to Czechia, must be equal",111,"Error #111: "]
["Suma hodnot v červených polích na listu J1-3",{"$f":"SUM(J13_KOMPOZITY_CERVENE)","v":0},"Suma hodnot v červených polích na listu J1-3K",{"$f":"SUM(J13K_KOMPOZITY_CERVENE)","v":0},"",0,"Chyba vyplnění na listech J1-3 a J1-3K: Součet hmotnosti kompozitních obalů na listu J1-3 ve sloupci neobsahují nápoje vyrobené, nakoupené v ČR a jejich hmotnostního rozpadu na listu J1-3K ve sloupci neobsahují nápoje vyrobené, nakoupené v ČR, musí být roven","Fill error on sheets J1-3 and J1-3K: The sum of the weights of composite packaging on sheet J1-3 in the column non beverage, produced, bought in Czechia and their mass decay on sheet J1-3K in the  column non beverage, produced, bought in Czechia, must be equal",112,"Error #112: "]
["Suma hodnot v oranžových polích na listu J1-3",{"$f":"SUM(J13_KOMPOZITY_ORANZOVE)","v":0},"Suma hodnot v oranžových polích na listu J1-3K",{"$f":"SUM(J13K_KOMPOZITY_ORANZOVE)","v":0},"",0,"Chyba vyplnění na listech J1-3 a J1-3K: Součet hmotnosti kompozitních obalů na listu J1-3 ve sloupci neobsahují nápoje importované do ČR a jejich hmotnostního rozpadu na listu J1-3K ve sloupci neobsahují nápoje importované do ČR, musí být roven","Fill error on sheets J1-3 and J1-3K: The sum of the weights of composite packaging on sheet J1-3 in the column non beverage, imported to Czechia and their mass decay on sheet J1-3K in the  column non beverage, imported to Czechia, must be equal",113,"Error #113: "]
["Suma hodnot v zelených polích na listu J1-3",{"$f":"SUM(J13_KOMPOZITY_ZELENE)","v":0},"Suma hodnot v zelených polích na listu J1-3K",{"$f":"SUM(J13K_KOMPOZITY_ZELENE)","v":0},"",0,"Chyba vyplnění na listech J1-3 a J1-3K: Součet hmotnosti kompozitních obalů na listu J1-3 ve sloupci obsahují nápoje vyrobené, nakoupené v ČR a jejich hmotnostního rozpadu na listu J1-3K ve sloupci obsahují nápoje vyrobené, nakoupené v ČR, musí být roven","Fill error on sheets J1-3 and J1-3K: The sum of the weights of composite packaging on sheet J1-3 in the column beverage, produced, bought in Czechia and their mass decay on sheet J1-3K in the  column beverage, produced, bought in Czechia, must be equal",114,"Error #114: "]
["Suma hodnot v šedých polích na listu J1-3",{"$f":"SUM(J13_KOMPOZITY_SEDE)","v":0},"Suma hodnot v šedých polích na listu J1-3K",{"$f":"SUM(J13K_KOMPOZITY_SEDE)","v":0},"",0,"Chyba vyplnění na listech J1-3 a J1-3K: Součet hmotnosti kompozitních obalů na listu J1-3 ve sloupci obsahují nápoje importované do ČR a jejich hmotnostního rozpadu na listu J1-3K ve sloupci obsahují nápoje importované do ČR, musí být roven","Fill error on sheets J1-3 and J1-3K: The sum of the weights of composite packaging on sheet J1-3 in the column beverage, imported to Czechia and their mass decay on sheet J1-3K in the  column beverage, imported to Czechia, must be equal",115,"Error #115: "]
["Suma hodnot v červených polích na listu O1-1A",{"$f":"SUM(O11A_KOMPOZITY_CERVENE)","v":0},"Suma hodnot v červených polích na listu O1-1K",{"$f":"SUM(O11K_KOMPOZITY_CERVENE)","v":0},"",0,"Chyba vyplnění na listech O1-1A a O1-1K: Součet hmotnosti kompozitních obalů na listu O1-1A ve sloupci vyrobené, nakoupené v ČR a jejich hmotnostního rozpadu na listu O1-1K ve sloupci prodejní vyrobené, nakoupené v ČR, musí být roven","Fill error on sheets O1-1A and O1-1K: The sum of the weights of composite packaging on sheet O1-1A in the column produced, bought in Czechia and their mass decay on sheet O1-1K in the column sales, produced, bought in Czechia, must be equal",116,"Error #116: "]
["Suma hodnot v oranžových polích na listu O1-1A",{"$f":"SUM(O11A_KOMPOZITY_ORANZOVE)","v":0},"Suma hodnot v oranžových polích na listu O1-1K",{"$f":"SUM(O11K_KOMPOZITY_ORANZOVE)","v":0},"",0,"Chyba vyplnění na listech O1-1A a O1-1K: Součet hmotnosti kompozitních obalů na listu O1-1A ve sloupci importované do ČR a jejich hmotnostního rozpadu na listu O1-1K ve sloupci prodejní importované do ČR, musí být roven","Fill error on sheets O1-1A and O1-1K: The sum of the weights of composite packaging on sheet O1-1A in the column imported to Czechia and their mass decay on sheet O1-1K in the column sales, imported to Czechia, must be equal",117,"Error #117: "]
["Suma hodnot v modrých polích na listu O1-1B",{"$f":"SUM(O11B_KOMPOZITY_MODRE)","v":0},"Suma hodnot v modrých polích na listu O1-1K",{"$f":"SUM(O11K_KOMPOZITY_MODRE)","v":0},"",0,"Chyba vyplnění na listech O1-1B a O1-1K: Součet hmotnosti kompozitních obalů na listu O1-1B ve sloupci vyrobené, nakoupené v ČR a jejich hmotnostního rozpadu na listu O1-1K ve sloupci skupinové vyrobené, nakoupené v ČR, musí být roven","Fill error on sheets O1-1B and O1-1K: The sum of the weights of composite packaging on sheet O1-1B in the column produced, bought in Czechia and their mass decay on sheet O1-1K in the column group, produced, bought in Czechia, must be equal",118,"Error #118: "]
["Suma hodnot ve žlutých polích na listu O1-1B",{"$f":"SUM(O11B_KOMPOZITY_ZLUTE)","v":0},"Suma hodnot ve žlutých polích na listu O1-1K",{"$f":"SUM(O11K_KOMPOZITY_ZLUTE)","v":0},"",0,"Chyba vyplnění na listech O1-1B a O1-1K: Součet hmotnosti kompozitních obalů na listu O1-1B ve sloupci importované do ČR a jejich hmotnostního rozpadu na listu O1-1K ve sloupci skupinové importované do ČR, musí být roven","Fill error on sheets O1-1B and O1-1K: The sum of the weights of composite packaging on sheet O1-1B in the column imported to Czechia and their mass decay on sheet O1-1K in the column group, imported to Czechia, must be equal",119,"Error #119: "]
["Suma hodnot v zelených polích na listu O1-1B",{"$f":"SUM(O11B_KOMPOZITY_ZELENE)","v":0},"Suma hodnot v zelených polích na listu O1-1K",{"$f":"SUM(O11K_KOMPOZITY_ZELENE)","v":0},"",0,"Chyba vyplnění na listech O1-1B a O1-1K: Součet hmotnosti kompozitních obalů na listu O1-1B ve sloupci vyrobené, nakoupené v ČR a jejich hmotnostního rozpadu na listu O1-1K ve sloupci přepravní vyrobené, nakoupené v ČR, musí být roven","Fill error on sheets O1-1B and O1-1K: The sum of the weights of composite packaging on sheet O1-1B in the column produced, bought in Czechia and their mass decay on sheet O1-1K in the column transport, produced, bought in Czechia, must be equal",120,"Error #120: "]
["Suma hodnot v šedých polích na listu O1-1B",{"$f":"SUM(O11B_KOMPOZITY_SEDE)","v":0},"Suma hodnot v šedých polích na listu O1-1K",{"$f":"SUM(O11K_KOMPOZITY_SEDE)","v":0},"",0,"Chyba vyplnění na listech O1-1B a O1-1K: Součet hmotnosti kompozitních obalů na listu O1-1B ve sloupci importované do ČR a jejich hmotnostního rozpadu na listu O1-1K ve sloupci přepravní importované do ČR, musí být roven","Fill error on sheets O1-1B and O1-1K: The sum of the weights of composite packaging on sheet O1-B in the column imported to Czechia and their mass decay on sheet O1-1K in the column transport, imported to Czechia, must be equal",121,"Error #121: "]
["Suma hodnot v červených polích na listu O1-2A",{"$f":"SUM(O12A_KOMPOZITY_CERVENE)","v":0},"Suma hodnot v červených polích na listu O1-2K",{"$f":"SUM(O12K_KOMPOZITY_CERVENE)","v":0},"",0,"Chyba vyplnění na listech O1-2A a O1-2K: Součet hmotnosti kompozitních obalů na listu O1-2A ve sloupci vyrobené, nakoupené v ČR a jejich hmotnostního rozpadu na listu O1-2K ve sloupci prodejní vyrobené, nakoupené v ČR, musí být roven","Fill error on sheets O1-2A and O1-2K: The sum of the weights of composite packaging on sheet O1-2A in the column produced, bought in Czechia and their mass decay on sheet O1-2K in the column sales, produced, bought in Czechia, must be equal",122,"Error #122: "]
["Suma hodnot v oranžových polích na listu O1-2A",{"$f":"SUM(O12A_KOMPOZITY_ORANZOVE)","v":0},"Suma hodnot v oranžových polích na listu O1-2K",{"$f":"SUM(O12K_KOMPOZITY_ORANZOVE)","v":0},"",0,"Chyba vyplnění na listech O1-2A a O1-2K: Součet hmotnosti kompozitních obalů na listu O1-2A ve sloupci importované do ČR a jejich hmotnostního rozpadu na listu O1-2K ve sloupci prodejní importované do ČR, musí být roven","Fill error on sheets O1-2A and O1-2K: The sum of the weights of composite packaging on sheet O1-2A in the column imported to Czechia and their mass decay on sheet O1-2K in the column sales, imported to Czechia, must be equal",123,"Error #123: "]
["Suma hodnot v modrých polích na listu O1-2B",{"$f":"SUM(O12B_KOMPOZITY_MODRE)","v":0},"Suma hodnot v modrých polích na listu O1-2K",{"$f":"SUM(O12K_KOMPOZITY_MODRE)","v":0},"",0,"Chyba vyplnění na listech O1-2B a O1-2K: Součet hmotnosti kompozitních obalů na listu O1-2B ve sloupci vyrobené, nakoupené v ČR a jejich hmotnostního rozpadu na listu O1-2K ve sloupci skupinové vyrobené, nakoupené v ČR, musí být roven","Fill error on sheets O1-2B and O1-2K: The sum of the weights of composite packaging on sheet O1-2B in the column produced, bought in Czechia and their mass decay on sheet O1-2K in the column group, produced, bought in Czechia, must be equal",124,"Error #124: "]
["Suma hodnot ve žlutých polích na listu O1-2B",{"$f":"SUM(O12B_KOMPOZITY_ZLUTE)","v":0},"Suma hodnot ve žlutých polích na listu O1-2K",{"$f":"SUM(O12K_KOMPOZITY_ZLUTE)","v":0},"",0,"Chyba vyplnění na listech O1-2B a O1-2K: Součet hmotnosti kompozitních obalů na listu O1-2B ve sloupci importované do ČR a jejich hmotnostního rozpadu na listu O1-2K ve sloupci skupinové importované do ČR, musí být roven","Fill error on sheets O1-2B and O1-2K: The sum of the weights of composite packaging on sheet O1-2B in the column imported to Czechia and their mass decay on sheet O1-2K in the column group, imported to Czechia, must be equal",125,"Error #125: "]
["Suma hodnot v zelených polích na listu O1-2B",{"$f":"SUM(O12B_KOMPOZITY_ZELENE)","v":0},"Suma hodnot v zelených polích na listu O1-2K",{"$f":"SUM(O12K_KOMPOZITY_ZELENE)","v":0},"",0,"Chyba vyplnění na listech O1-2B a O1-2K: Součet hmotnosti kompozitních obalů na listu O1-2B ve sloupci vyrobené, nakoupené v ČR a jejich hmotnostního rozpadu na listu O1-2K ve sloupci přepravní vyrobené, nakoupené v ČR, musí být roven","Fill error on sheets O1-2B and O1-2K: The sum of the weights of composite packaging on sheet O1-2B in the column produced, bought in Czechia and their mass decay on sheet O1-2K in the column transport, produced, bought in Czechia, must be equal",126,"Error #126: "]
["Suma hodnot v šedých polích na listu O1-2B",{"$f":"SUM(O12B_KOMPOZITY_SEDE)","v":0},"Suma hodnot v šedých polích na listu O1-2K",{"$f":"SUM(O12K_KOMPOZITY_SEDE)","v":0},"",0,"Chyba vyplnění na listech O1-2B a O1-2K: Součet hmotnosti kompozitních obalů na listu O1-2B ve sloupci importované do ČR a jejich hmotnostního rozpadu na listu O1-2K ve sloupci přepravní importované do ČR, musí být roven","Fill error on sheets O1-2B and O1-2K: The sum of the weights of composite packaging on sheet O1-2B in the column imported to Czechia and their mass decay on sheet O1-2K in the column transport, imported to Czechia, must be equal",127,"Error #127: "]
["Suma hodnot v červených polích na listu O1-3",{"$f":"SUM(O13_KOMPOZITY_CERVENE)","v":0},"Suma hodnot v červených polích na listu O1-3K",{"$f":"SUM(O13K_KOMPOZITY_CERVENE)","v":0},"",0,"Chyba vyplnění na listech O1-3 a O1-3K: Součet hmotnosti kompozitních obalů na listu O1-3 ve sloupci neobsahují nápoje vyrobené, nakoupené v ČR a jejich hmotnostního rozpadu na listu O1-3K ve sloupci neobsahují nápoje vyrobené, nakoupené v ČR, musí být roven","Fill error on sheets O1-3 and O1-3K: The sum of the weights of composite packaging on sheet O1-3 in the column non beverage, produced, bought in Czechia and their mass decay on sheet O1-3K in the  column non beverage, produced, bought in Czechia, must be equal",128,"Error #128: "]
["Suma hodnot v oranžových polích na listu O1-3",{"$f":"SUM(O13_KOMPOZITY_ORANZOVE)","v":0},"Suma hodnot v oranžových polích na listu O1-3K",{"$f":"SUM(O13K_KOMPOZITY_ORANZOVE)","v":0},"",0,"Chyba vyplnění na listech O1-3 a O1-3K: Součet hmotnosti kompozitních obalů na listu O1-3 ve sloupci neobsahují nápoje importované do ČR a jejich hmotnostního rozpadu na listu O1-3K ve sloupci neobsahují nápoje importované do ČR, musí být roven","Fill error on sheets O1-3 and O1-3K: The sum of the weights of composite packaging on sheet O1-3 in the column non beverage, imported to Czechia and their mass decay on sheet O1-3K in the  column non beverage, imported to Czechia, must be equal",129,"Error #129: "]
["Suma hodnot v zelených polích na listu O1-3",{"$f":"SUM(O13_KOMPOZITY_ZELENE)","v":0},"Suma hodnot v zelených polích na listu O1-3K",{"$f":"SUM(O13K_KOMPOZITY_ZELENE)","v":0},"",0,"Chyba vyplnění na listech O1-3 a O1-3K: Součet hmotnosti kompozitních obalů na listu O1-3 ve sloupci obsahují nápoje vyrobené, nakoupené v ČR a jejich hmotnostního rozpadu na listu O1-3K ve sloupci obsahují nápoje vyrobené, nakoupené v ČR, musí být roven","Fill error on sheets O1-3 and O1-3K: The sum of the weights of composite packaging on sheet O1-3 in the column beverage, produced, bought in Czechia and their mass decay on sheet O1-3K in the  column beverage, produced, bought in Czechia, must be equal",130,"Error #130: "]
["Suma hodnot v šedých polích na listu O1-3",{"$f":"SUM(O13_KOMPOZITY_SEDE)","v":0},"Suma hodnot v šedých polích na listu O1-3K",{"$f":"SUM(O13K_KOMPOZITY_SEDE)","v":0},"",0,"Chyba vyplnění na listech O1-3 a O1-3K: Součet hmotnosti kompozitních obalů na listu O1-3 ve sloupci obsahují nápoje importované do ČR a jejich hmotnostního rozpadu na listu O1-3K ve sloupci obsahují nápoje importované do ČR, musí být roven","Fill error on sheets O1-3 and O1-3K: The sum of the weights of composite packaging on sheet O1-3 in the column beverage, imported to Czechia and their mass decay on sheet O1-3K in the  column beverage, imported to Czechia, must be equal",131,"Error #131: "]
[]
["Texty","Částka - Výstupní hláška","Titulek listu TEST - Výstupní hláška","Částka - Hláška CZ","Titulek listu TEST - Hláška CZ","Částka - Hláška EN","Titulek listu TEST - Hláška EN"]
["když obsahuje chyby",{"$f":"IF($B$1=\"CZ\",D77,F77)","v":"POZOR, CHYBA VYPLNĚNÍ, \nPROSÍM OPRAVTE!\npopis chyb naleznete na listu TEST"},{"$f":"IF($B$1=\"CZ\",E77,G77)","v":"VÝKAZ OBSAHUJE NÁSLEDUJÍCÍ CHYBY:"},"POZOR, CHYBA VYPLNĚNÍ, \nPROSÍM OPRAVTE!\npopis chyb naleznete na listu TEST","VÝKAZ OBSAHUJE NÁSLEDUJÍCÍ CHYBY:","ATTENTION, ERROR, \nPLEASE CORRECT!\nsee the TEST sheet for errors specification","THESE ERRORS ARE IN THE STATEMENT:"]
["když neobsahuje chyby",null,{"$f":"IF($B$1=\"CZ\",E78,G78)","v":"VÝKAZ JE BEZ CHYB"},null,"VÝKAZ JE BEZ CHYB",null,"THE STATEMENT IS ERROR-FREE"]
[]
["List L TAŠKY - tuny","List L TAŠKY - kusy","Podmínka závěr kontroly","Ćíslo chyby","Popis chyby","Výstupní hláška","Hláška CZ","Hláška EN"]
[{"$f":"L!F12","v":0},{"$f":"L!G12","v":0},{"$f":"IF(A81=0,IF(B81=0,0,1),IF(B81=0,2,IF(A81/B81*1000000<1,3,IF(A81/B81*1000000>60,4,0))))","v":0},200,{"$f":"\"Error #\"&D81&\": \"","v":"Error #200: "},{"$f":"IF(C81>2,IF($B$1=\"CZ\",E81&G81&\" \",E81&H81&\" \"),IF(C81=0,\"\",IF($B$1=\"CZ\",E82&G82&\" \",E82&H82&\" \")))","v":""},"Chyba vyplnění na listu L - hmotnost jednoho kusu lehké plastové tašky 15 < 50 mikronů se průměrně pohybuje od 1 do 60 gramů.","Fill error on sheet L - The average weight of one piece of Lightweight plastic bag 15 < 50 microns ranges from 1 to 60 grams."]
[null,null,null,201,{"$f":"\"Error #\"&D82&\": \"","v":"Error #201: "},null,"Chyba vyplnění na listu L  - lehké plastové tašky 15 < 50 mikronů - musí být vyplněny tuny i kusy. ","Fill error on sheets L - tons and pieces must be filled."]
[{"$f":"L!F13","v":0},{"$f":"L!G13","v":0},{"$f":"IF(A83=0,IF(B83=0,0,1),IF(B83=0,2,IF(A83/B83*1000000<0.5,3,IF(A83/B83*1000000>10,4,0))))","v":0},202,{"$f":"\"Error #\"&D83&\": \"","v":"Error #202: "},{"$f":"IF(C83>2,IF($B$1=\"CZ\",E83&G83&\" \",E83&H83&\" \"),IF(C83=0,\"\",IF($B$1=\"CZ\",E84&G84&\" \",E84&H84&\" \")))","v":""},"Chyba vyplnění na listu L - hmotnost jednoho kusu lehké plastové tašky < 15 mikronů se průměrně pohybuje od 0,5 do 10 gramů.","Fill error on sheet L - The average weight of one piece of Lightweight plastic bag < 15 microns ranges from 0,5 to 10 grams."]
[null,null,null,203,{"$f":"\"Error #\"&D84&\": \"","v":"Error #203: "},null,"Chyba vyplnění na listu L  - lehké plastové tašky - musí být vyplněny tuny i kusy. ","Fill error on sheets L - tons and pieces must be filled."]
[]
["List L KELÍMKY - hmotnost plastu","List L KELÍMKY - celková hmotnost","Podmínka závěr kontroly","Ćíslo chyby","Popis chyby","Výstupní hláška","Hláška CZ","Hláška EN"]
[{"$f":"L!E9","v":0},{"$f":"L!F9","v":0},{"$f":"IF(A87=0,IF(B87=0,0,2),IF(B87=0,1,IF(A87>=B87,3,0)))","v":0},300,{"$f":"\"Error #\"&D87&\": \"","v":"Error #300: "},{"$f":"IF(C87=1,IF($B$1=\"CZ\",E87&G87&\" \",E87&H87&\" \"),IF(C87=2,IF($B$1=\"CZ\",E88&G88&\" \",E88&H88&\" \"),IF(C87=3,IF($B$1=\"CZ\",E89&G89&\" \",E89&H89&\" \"),\"\")))","v":""},"Chyba vyplnění na listu L - je nutné vyplnit i sloupec „celková hmotnost v tunách“ u nápojového kelímku vyrobeného částečně z plastu.","Error on sheet L, it is also necessary to fill in the \"total weight in tonnes\" column for Cups for beverages made partly from plastic."]
[null,null,null,301,{"$f":"\"Error #\"&D88&\": \"","v":"Error #301: "},null,"Chyba vyplnění na listu L - je nutné vyplnit i sloupec „hmotnost plastu v tunách“ u nápojového kelímku vyrobeného částečně z plastu.","Error on sheet L, it is also necessary to fill in the \"weight of plastic in tonnes\" column for Cups for beverages made partly from plastic."]
[null,null,null,302,{"$f":"\"Error #\"&D89&\": \"","v":"Error #302: "},null,"Chyba na listě L, „celková hmotnost v tunách“  musí být vyšší než „hmotnost plastu v tunách“ u nápojového kelímku vyrobeného částečně z plastu.","Error on sheet L, the \"total weight tonnes\" must be higher than the \"weight of plastic in tonnes\" for Cups for beverages made partly from plastic."]
[]
["List L NÁDOBY - hmotnost plastu","List L NÁDOBY - celková hmotnost","Podmínka závěr kontroly","Ćíslo chyby","Popis chyby","Výstupní hláška","Hláška CZ","Hláška EN"]
[{"$f":"L!E11","v":0},{"$f":"L!F11","v":0},{"$f":"IF(A92=0,IF(B92=0,0,2),IF(B92=0,1,IF(A92>=B92,3,0)))","v":0},400,{"$f":"\"Error #\"&D92&\": \"","v":"Error #400: "},{"$f":"IF(C92=1,IF($B$1=\"CZ\",E92&G92&\" \",E87&H87&\" \"),IF(C92=2,IF($B$1=\"CZ\",E93&G93&\" \",E93&H93&\" \"),IF(C92=3,IF($B$1=\"CZ\",E94&G94&\" \",E94&H94&\" \"),\"\")))","v":""},"Chyba vyplnění na listu L - je nutné vyplnit i sloupec „celková hmotnost v tunách“ u nádoby na potraviny vyrobené částečně z plastu.","Error on sheet L, it is also necessary to fill in the \"total weight in tonnes\" column for Food containers made partly from plastic."]
[null,null,null,401,{"$f":"\"Error #\"&D93&\": \"","v":"Error #401: "},null,"Chyba vyplnění na listu L - je nutné vyplnit i sloupec „hmotnost plastu v tunách“ u nádoby na potraviny vyrobené částečně z plastu.","Error on sheet L, it is also necessary to fill in the \"weight of plastic in tonnes\" column for Food containers made partly from plastic."]
[null,null,null,402,{"$f":"\"Error #\"&D94&\": \"","v":"Error #402: "},null,"Chyba vyplnění na listu L, „celková hmotnost v tunách“  musí být vyšší než „hmotnost plastu v tunách“ u nádoby na potraviny vyrobené částečně z plastu.","Error on sheet L, the \"total weight tonnes\" must be higher than the \"weight of plastic in tonnes\" for Food containers made partly from plastic."]
[]
["Sleva rPET - list J1-2A",null,null,null,"podíl recyklátu"]
["PET","transparentní",{"$f":"'J1-2A'!I10+'J1-2A'!J10","v":0},{"$f":"'J1-2A'!K10+'J1-2A'!L10","v":0},{"$f":"IFERROR(D97/(D97+C97),0)","v":0}]
[null,"barevný",{"$f":"'J1-2A'!I11+'J1-2A'!J11","v":0},{"$f":"'J1-2A'!K11+'J1-2A'!L11","v":0},{"$f":"IFERROR(D98/(D98+C98),0)","v":0}]
[null,"neprůhledný",{"$f":"'J1-2A'!I12+'J1-2A'!J12","v":0},{"$f":"'J1-2A'!K12+'J1-2A'!L12","v":0},0]
[]
["sazba bez slevy",null,"cena virgin","cena recyklát"]
["PET","transparentní",{"$f":"'J1-2A'!I10*SUM!B1043+'J1-2A'!J10*SUM!B1082","v":0},{"$f":"'J1-2A'!K10*SUM!B1109+'J1-2A'!L10*SUM!B1148","v":0}]
[null,"barevný",{"$f":"'J1-2A'!I11*SUM!B1044+'J1-2A'!J11*SUM!B1083","v":0},{"$f":"'J1-2A'!K11*SUM!B1110+'J1-2A'!L11*SUM!B1149","v":0}]
[null,"neprůhledný",{"$f":"'J1-2A'!I12*SUM!B1045+'J1-2A'!J12*SUM!B1084","v":0},{"$f":"'J1-2A'!K12*SUM!B1111+'J1-2A'!L12*SUM!B1150","v":0}]
[]
["sleva",null,10500,"limit slevy"]
["PET","transparentní",{"$f":"IF(E97<D107,((C97+D97)*E97*$C$106),((C97+D97)*D107*$C$106))","v":0},0.35]
[null,"barevný",{"$f":"IF(E98<D108,((C98+D98)*E98*$C$106),((C98+D98)*D108*$C$106))","v":0},0.35]
[null,"neprůhledný",0,0.35]
[null,null,{"$f":"SUM(C107:C109)","v":0}]
["celková cena"]
["PET","transparentní",{"$f":"C102+D102-C107","v":0}]
[null,"barevný",{"$f":"C103+D103-C108","v":0}]
[null,"neprůhledný",0]
[]
[]
["celková cena"]
["PET","transparentní",{"$f":"IF(C112<0.000000000000001,0,C112)","v":0}]
[null,"barevný",{"$f":"IF(C113<0.000000000000001,0,C113)","v":0}]
[null,"neprůhledný",0]
["CELKOVÝ SOUČET SLEV",null,{"$f":"SUM(C118:C120)","v":0}]

{"sheet":"TEST","index":2,"n_rows":35,"n_cols":2,"rows_kept":35,"cut":false,"hidden":false,"merged":[[1,0,1,1],[0,0,0,1]]}
[{"$f":"KONTROLY!C40","v":"VYPLNILI JSTE TYTO LISTY: "}]
[{"$f":"IF(A4&A5&A6&A7&A8&A9&A10&A11&A12&A13&A14&A15&A16&A17&A18&A19&A20&A21&A22&A23&A24&A25&A26&A27&A28&A29&A30&A31&A32&A33&A34&A35&B4&B5&B6&B7&B8&B9&B10&B11&B12&B13&B14&B15&B16&B17&B18&B19&B20&B21&B22&B23&B24&B25&B26&B27&B28&B29&B30&B31&B32&B33&B34&B35<>\"\",KONTROLY!C77,KONTROLY!C78)","v":"VÝKAZ OBSAHUJE NÁSLEDUJÍCÍ CHYBY:"}]
[]
[{"$f":"IF(KONTROLY!C4<>\"\",CONCATENATE(KONTROLY!H4,KONTROLY!C4),\"\")","v":""},{"$f":"KONTROLY!E43","v":""}]
[{"$f":"IF(KONTROLY!C5<>\"\",CONCATENATE(KONTROLY!H5,KONTROLY!C5),\"\")","v":""},{"$f":"KONTROLY!E44","v":""}]
[{"$f":"IF(KONTROLY!C6<>\"\",CONCATENATE(KONTROLY!H6,KONTROLY!C6),\"\")","v":"Error #3: List ÚVOD -  EKOKOM ID (musí začínat jedním písmenem a jeho délka musí být 9 znaků)"},{"$f":"KONTROLY!E45","v":""}]
[{"$f":"KONTROLY!C12","v":""},{"$f":"KONTROLY!E46","v":""}]
[{"$f":"KONTROLY!C13","v":""},{"$f":"KONTROLY!E47","v":""}]
[{"$f":"KONTROLY!C14","v":""},{"$f":"KONTROLY!E48","v":""}]
[{"$f":"KONTROLY!C15","v":""},{"$f":"KONTROLY!E49","v":""}]
[{"$f":"KONTROLY!C16","v":""},{"$f":"KONTROLY!E50","v":""}]
[{"$f":"KONTROLY!C17","v":""},{"$f":"KONTROLY!E51","v":""}]
[{"$f":"KONTROLY!C18","v":""},{"$f":"KONTROLY!E52","v":""}]
[{"$f":"KONTROLY!C19","v":""},{"$f":"KONTROLY!E53","v":""}]
[{"$f":"KONTROLY!C20","v":""},{"$f":"KONTROLY!E54","v":""}]
[{"$f":"KONTROLY!C21","v":""},{"$f":"KONTROLY!E55","v":""}]
[{"$f":"KONTROLY!C22","v":""},{"$f":"KONTROLY!E56","v":""}]
[{"$f":"KONTROLY!C23","v":""},{"$f":"KONTROLY!E57","v":""}]
[{"$f":"KONTROLY!C24","v":""},{"$f":"KONTROLY!E58","v":""}]
[{"$f":"KONTROLY!C25","v":""},{"$f":"KONTROLY!E59","v":""}]
[{"$f":"KONTROLY!C26","v":""},{"$f":"KONTROLY!E60","v":""}]
[{"$f":"KONTROLY!C27","v":""},{"$f":"KONTROLY!E61","v":""}]
[{"$f":"KONTROLY!C28","v":""},{"$f":"KONTROLY!E62","v":""}]
[{"$f":"KONTROLY!C29","v":""},{"$f":"KONTROLY!E63","v":""}]
[{"$f":"KONTROLY!C30","v":""},{"$f":"KONTROLY!E64","v":""}]
[{"$f":"KONTROLY!C31","v":""},{"$f":"KONTROLY!E65","v":""}]
[{"$f":"KONTROLY!C32","v":""},{"$f":"KONTROLY!E66","v":""}]
[{"$f":"KONTROLY!C33","v":""},{"$f":"KONTROLY!E67","v":""}]
[{"$f":"KONTROLY!C34","v":""},{"$f":"KONTROLY!E68","v":""}]
[{"$f":"KONTROLY!C35","v":""},{"$f":"KONTROLY!E69","v":""}]
[{"$f":"KONTROLY!C36","v":""},{"$f":"KONTROLY!E70","v":""}]
[{"$f":"KONTROLY!F81","v":""},{"$f":"KONTROLY!E71","v":""}]
[{"$f":"KONTROLY!F83","v":""},{"$f":"KONTROLY!E72","v":""}]
[{"$f":"KONTROLY!F87","v":""},{"$f":"KONTROLY!E73","v":""}]
[{"$f":"KONTROLY!F92","v":""},{"$f":"KONTROLY!E74","v":""}]

{"sheet":"Úvod","index":3,"n_rows":23,"n_cols":6,"rows_kept":23,"cut":false,"hidden":false,"merged":[[20,2,20,7],[21,1,21,7],[22,3,22,7],[24,3,24,4],[15,1,15,7],[17,1,17,2],[17,3,17,7],[18,2,18,7],[19,2,19,7],[16,2,16,4],[14,1,14,7],[5,1,5,2],[5,3,5,7],[6,1,6,7],[7,1,7,2],[7,3,7,7],[8,1,8,7],[9,4,9,7],[11,5,11,6],[13,1,13,2],[13,5,13,6],[4,3,4,5],[0,1,0,7],[1,1,1,7],[2,1,2,7],[3,1,3,2],[3,4,3,7],[4,6,4,7]]}
[{"$f":"KONTROLY!H1","v":"2.72"}," "]
[null,"Výkaz o produkci obalů"]
[]
[null,"za ",null,2,". čtvrtletí roku 2025"]
[]
[null,"Název společnosti:"]
[]
[null,"Sídlo společnosti:"]
[]
[null,"E-mail pro příjem faktur:"]
[]
[null," IČO:",null,null," DIČ:"]
[null,"Číslo Vaší objednávky:",null,null,"EKOKOM-ID:"]
[null,null,null,null," EK-"]
[null,"Metodiku pro vyplnění tohoto výkazu naleznete na www.ekokom.cz"]
[null,{"$f":"KONTROLY!C9","v":"POZOR!!  Zkontrolujte prosím následující pole na této stránce: EKOKOM ID (musí začínat jedním písmenem a jeho délka musí být 9 znaků)"}]
[null,null,"Vyplněný výkaz zašlete na: ",null,null,"vykazy@ekokom.cz"]
[null,"Kontaktní osoba:"]
[null,"Tel:"]
[null,"Fax:"]
[null,"E-mail:"]
[]
[null,"Odhad fakturace:",null,{"$f":"IF(TEST!A2=KONTROLY!C77,KONTROLY!B77,SUM!C1)","v":"POZOR, CHYBA VYPLNĚNÍ, \nPROSÍM OPRAVTE!\npopis chyb naleznete na listu TEST"}]

{"sheet":"J1-1A","index":4,"n_rows":65,"n_cols":18,"rows_kept":65,"cut":false,"hidden":false,"merged":[[1,13,1,15],[40,10,40,11],[45,8,45,9],[45,10,45,11],[50,10,50,11],[49,10,49,11],[50,8,50,9],[41,10,41,11],[49,6,49,7],[50,6,50,7],[42,10,42,11],[43,8,43,9],[43,10,43,11],[46,8,46,9],[42,6,42,7],[43,6,43,7],[45,6,45,7],[44,10,44,11],[5,10,5,11],[2,13,2,15],[6,12,8,12],[6,13,8,13],[6,14,8,14],[34,4,34,7],[51,0,51,3],[51,8,51,9],[46,10,46,11],[47,8,47,9],[47,10,47,11],[48,8,48,9],[48,10,48,11],[46,6,46,7],[47,6,47,7],[48,6,48,7],[50,0,50,3],[47,1,47,3],[48,1,48,3],[48,0,49,0],[49,1,49,3],[49,4,49,5],[50,4,50,5],[49,8,49,9],[51,4,51,5],[46,4,46,5],[47,4,47,5],[48,4,48,5],[51,10,51,11],[51,6,51,7],[40,0,42,0],[43,0,47,0],[40,6,40,7],[41,4,41,5],[43,1,43,3],[42,4,42,5],[43,4,43,5],[45,4,45,5],[41,8,41,9],[45,1,45,3],[46,1,46,3],[40,4,40,5],[41,6,41,7],[42,1,42,3],[40,1,40,3],[41,1,41,3],[44,1,44,3],[44,6,44,7],[44,8,44,9],[40,8,40,9],[44,4,44,5],[42,8,42,9],[0,0,0,3],[32,1,32,3],[9,0,29,0],[9,1,11,1],[9,2,9,3],[33,1,33,3],[16,2,16,3],[17,2,17,3],[10,2,10,3],[11,2,11,3],[12,2,12,3],[13,2,13,3],[14,2,14,3],[12,1,13,1],[26,1,27,1],[28,1,29,1],[26,2,26,3],[25,2,25,3],[20,2,20,3],[24,1,25,1],[20,1,21,1],[18,1,19,1],[37,0,39,3],[14,1,15,1],[16,1,17,1],[22,1,23,1],[38,4,39,5],[38,6,39,7],[38,8,39,9],[38,10,39,11],[1,0,1,12],[2,0,2,12],[3,0,8,3],[6,4,8,4],[6,5,8,5],[6,6,8,6],[6,7,8,7],[6,8,8,8],[6,9,8,9],[6,10,8,10],[35,0,35,3],[19,2,19,3],[18,2,18,3],[30,0,33,0],[15,2,15,3],[34,0,34,3],[37,4,37,7],[37,8,37,11],[6,15,8,15],[0,12,0,15],[4,4,4,7],[23,2,23,3],[22,2,22,3],[21,2,21,3],[0,8,0,11],[0,4,0,7],[29,2,29,3],[24,2,24,3],[27,2,27,3],[5,8,5,9],[3,4,3,15],[4,12,4,15],[5,12,5,13],[5,14,5,15],[6,11,8,11],[4,8,4,11],[5,6,5,7],[5,4,5,5],[31,1,31,3],[30,1,30,3]]}
["jedno použití",null,null,null,"zpoplatněné",null,null,null,"neobsahují nápoje",null,null,null,"prodejní",null,null,null,null,{"$f":"R10*R11*R12*R13*R14*R15*R16*R17*R18*R19*R20*R21*R22*R23*R24*R25*R26*R27*R28*R29*R30*R31*R32*R33*R34*R35*R36*R41*R42*R43*R44*R45*R46*R47*R48*R49*R50*R51*R52","v":0}]
["J1-1A Obaly a obalové prostředky pro jedno použití (1) - zpoplatněné",null,null,null,null,null,null,null,null,null,null,null,null,{"$f":"\"IČO: \"&Úvod!C12","v":"IČO: "},null,null,null,0]
["Výkaz o obalech, které neobsahují nápoje (2) - prodejní obaly a obalové prostředky uvedené na trh nebo do oběhu",null,null,null,null,null,null,null,null,null,null,null,null,{"$f":"Úvod!D4&Úvod!E4","v":"2. čtvrtletí roku 2025"}]
["Vyplňujte v tunách",null,null,null,"OBCHODNÍ (3) - Prodejní"]
[null,null,null,null,"Měkké, flexibilní",null,null,null,"Pevné, pevné duté do 3 L ",null,null,null,"Pevné duté nad 3 L "]
[null,null,null,null,"primární (4)",null,"recyklát (5)",null,"primární (4)",null,"recyklát (5)",null,"primární (4)",null,"recyklát (5)"]
[null,null,null,null,"vyrobené, nakoupené \nv ČR","importované \ndo ČR","vyrobené, nakoupené \nv ČR","importované \ndo ČR","vyrobené, nakoupené \nv ČR","importované \ndo ČR","vyrobené, nakoupené \nv ČR","importované \ndo ČR","vyrobené, nakoupené \nv ČR","importované \ndo ČR","vyrobené, nakoupené \nv ČR","importované \ndo ČR"]
[]
[]
["Plasty","PET","transparentní (6)",null,null,null,null,null,null,null,null,null,null,null,null,null,null,{"$f":"E10*F10*G10*H10*I10*J10*K10*L10*M10*N10*O10*P10*$R$2","v":0}]
[null,null,"průhledné barevné (8)",null,null,null,null,null,null,null,null,null,null,null,null,null,null,0]
[null,null,"neprůhledné barevné (9)",null,null,null,null,null,null,null,null,null,null,null,null,null,null,0]
[null,"PE","transparentní (6)",null,null,null,null,null,null,null,null,null,null,null,null,null,null,0]
[null,null,"barevné (7)",null,null,null,null,null,null,null,null,null,null,null,null,null,null,0]
[null,"PP","transparentní (6)",null,null,null,null,null,null,null,null,null,null,null,null,null,null,0]
[null,null,"barevné (7)",null,null,null,null,null,null,null,null,null,null,null,null,null,null,0]
[null,"PS","transparentní (6)",null,null,null,null,null,null,null,null,null,null,null,null,null,null,0]
[null,null,"barevné (7)",null,null,null,null,null,null,null,null,null,null,null,null,null,null,0]
[null,"XPS","transparentní (6)",null,null,null,null,null,null,null,null,null,null,null,null,null,null,0]
[null,null,"barevné (7)",null,null,null,null,null,null,null,null,null,null,null,null,null,null,0]
[null,"EPS","transparentní (6)",null,null,null,null,null,null,null,null,null,null,null,null,null,null,0]
[null,null,"barevné (7)",null,null,null,null,null,null,null,null,null,null,null,null,null,null,0]
[null,"PVC","transparentní (6)",null,null,null,null,null,null,null,null,null,null,null,null,null,null,0]
[null,null,"barevné (7)",null,null,null,null,null,null,null,null,null,null,null,null,null,null,0]
[null,"Jiné","transparentní (6)",null,null,null,null,null,null,null,null,null,null,null,null,null,null,0]
[null,null,"barevné (7)",null,null,null,null,null,null,null,null,null,null,null,null,null,null,0]
[null,"Biologicky rozložitelné (11)","transparentní (6)",null,null,null,null,null,null,null,null,null,null,null,null,null,null,0]
[null,null,"barevné (7)",null,null,null,null,null,null,null,null,null,null,null,null,null,null,0]
[null,"Kompozitní \n(10)","transparentní (6)",null,null,null,null,null,null,null,null,null,null,null,null,null,null,0]
[null,null,"barevné (7)",null,null,null,null,null,null,null,null,null,null,null,null,null,null,0]
["Kovy","Al",null,null,null,null,null,null,null,null,null,null,null,null,null,null,null,0]
[null,"Fe","FE",null,null,null,null,null,null,null,null,null,null,null,null,null,null,0]
[null,"Kompozitní Al (10)",null,null,null,null,null,null,null,null,null,null,null,null,null,null,null,0]
[null,"Kompozitní Fe (10)",null,null,null,null,null,null,null,null,null,null,null,null,null,null,null,0]
["Nápojový karton (2,10)",null,null,null,null,null,null,null,null,null,null,null,null,null,null,null,null,{"$f":"I35*J35*K35*L35*M35*N35*O35*P35*$R$2","v":0}]
["Kompozitní materiál (10)",null,null,null,null,null,null,null,null,null,null,null,null,null,null,null,null,{"$f":"E36*F36*G36*H36*I36*J36*K36*L36*M36*N36*O36*P36*$R$2","v":0}]
[]
["Vyplňujte v tunách",null,null,null,"primární (4)",null,null,null,"recyklát (5)"]
[null,null,null,null,"vyrobené, nakoupené \nv ČR",null,"importované \ndo ČR",null,"vyrobené, nakoupené \nv ČR",null,"importované \ndo ČR"]
[]
["Sklo","Transparentní (6)",null,null,null,null,null,null,null,null,null,null,null,null,null,null,null,{"$f":"E41*G41*I41*K41*$R$2","v":0}]
[null,"Barevné (7)",null,null,null,null,null,null,null,null,null,null,null,null,null,null,null,0]
[null,"Kompozitní (10)",null,null,null,null,null,null,null,null,null,null,null,null,null,null,null,0]
["Papír","Papír",null,null,null,null,null,null,null,null,null,null,null,null,null,null,null,0]
[null,"Hladká lepenka",null,null,null,null,null,null,null,null,null,null,null,null,null,null,null,0]
[null,"Vlnitá lepenka",null,null,null,null,null,null,null,null,null,null,null,null,null,null,null,0]
[null,"Nasávaná kartonáž",null,null,null,null,null,null,null,null,null,null,null,null,null,null,null,0]
[null,"Kompozitní (10)",null,null,null,null,null,null,null,null,null,null,null,null,null,null,null,0]
["Dřevo","Dřevo a dřevotříska",null,null,null,null,null,null,null,null,null,null,null,null,null,null,null,0]
[null,"Kompozit s nedřevěnými částmi (10)",null,null,null,null,null,null,null,null,null,null,null,null,null,null,null,0]
["Textil",null,null,null,null,null,null,null,null,null,null,null,null,null,null,null,null,0]
["Jiné",null,null,null,null,null,null,null,null,null,null,null,null,null,null,null,null,0]
[]
["1) Obaly, které nevyhovují kritériím § 13 odst. 3 zákona č. 477/2001 Sb., o obalech, a obaly a obalové prostředky uvedené v části D přílohy č. 4 \n  "]
["    k zákonu č. 477/2001 Sb., o obalech."]
["2) Obaly, které nevyhovují kritériím uvedeným ve směrnici EU 2019/904 odst. 12."]
["3) Obaly, které nevyhovují § 2 písm. q)  zákona č. 477/2001 Sb., o obalech."]
["4) Množství primární suroviny v obalu."]
["5) Prokazatelné množství recyklovaného materiálu v obalu."]
["6) Obaly, čiré bez viditelného zabarvení."]
["7) Obaly, průhledné se zabarvením či zcela probarvené."]
["8) Obaly z PET, průhledné se zabarvením."]
["9) Obaly z PET, zcela probarvené."]
["10) Pokračujte ve vyplňovaní na listu J1-1K."]
["11) Biologickým rozkladem je aerobní nebo anaerobní rozklad odpadů z obalů; oxo-rozložitelný plastový obal se nepovažuje za obal rozložitelný biologickým rozkladem."]

{"sheet":"J1-1B","index":5,"n_rows":60,"n_cols":22,"rows_kept":60,"cut":false,"hidden":false,"merged":[[49,16,49,17],[42,18,42,19],[43,18,43,19],[44,18,44,19],[45,18,45,19],[46,18,46,19],[47,18,47,19],[48,18,48,19],[49,18,49,19],[41,16,41,17],[41,18,41,19],[42,16,42,17],[43,16,43,17],[44,16,44,17],[45,16,45,17],[46,16,46,17],[47,16,47,17],[48,16,48,17],[41,14,41,15],[42,14,42,15],[43,14,43,15],[44,14,44,15],[45,14,45,15],[46,14,46,15],[47,14,47,15],[48,14,48,15],[49,14,49,15],[41,12,41,13],[42,12,42,13],[43,12,43,13],[44,12,44,13],[45,12,45,13],[46,12,46,13],[47,12,47,13],[48,12,48,13],[49,12,49,13],[41,10,41,11],[42,10,42,11],[43,10,43,11],[44,10,44,11],[45,10,45,11],[46,10,46,11],[47,10,47,11],[48,10,48,11],[49,10,49,11],[41,8,41,9],[42,8,42,9],[43,8,43,9],[44,8,44,9],[45,8,45,9],[46,8,46,9],[47,8,47,9],[48,8,48,9],[49,8,49,9],[42,4,42,5],[43,4,43,5],[44,4,44,5],[45,4,45,5],[46,4,46,5],[47,4,47,5],[48,4,48,5],[49,4,49,5],[41,6,41,7],[42,6,42,7],[43,6,43,7],[44,6,44,7],[45,6,45,7],[46,6,46,7],[47,6,47,7],[48,6,48,7],[49,6,49,7],[41,4,41,5],[36,12,36,19],[37,12,37,15],[37,16,37,19],[38,12,40,13],[38,14,40,15],[38,16,40,17],[38,18,40,19],[3,4,3,19],[36,4,36,11],[37,4,37,7],[37,8,37,11],[38,4,40,5],[38,6,40,7],[38,8,40,9],[38,10,40,11],[27,2,27,3],[48,0,48,3],[49,0,49,3],[28,1,29,1],[46,0,47,0],[46,1,46,3],[47,1,47,3],[34,0,34,3],[41,0,45,0],[41,1,41,3],[43,1,43,3],[44,1,44,3],[45,1,45,3],[29,2,29,3],[30,0,33,0],[30,1,30,3],[31,1,31,3],[32,1,32,3],[33,1,33,3],[36,0,40,3],[10,0,29,0],[10,1,11,1],[10,2,10,3],[26,1,27,1],[26,2,26,3],[11,2,11,3],[12,1,13,1],[12,2,12,3],[13,2,13,3],[14,1,15,1],[14,2,14,3],[15,2,15,3],[22,1,23,1],[22,2,22,3],[23,2,23,3],[16,1,17,1],[16,2,16,3],[17,2,17,3],[24,1,25,1],[24,2,24,3],[25,2,25,3],[18,1,19,1],[18,2,18,3],[19,2,19,3],[20,1,21,1],[20,2,20,3],[21,2,21,3],[0,0,0,4],[0,10,0,14],[0,5,0,9],[0,15,0,19],[3,0,9,3],[7,4,9,4],[7,5,9,5],[7,6,9,6],[7,7,9,7],[7,8,9,8],[7,9,9,9],[5,4,5,7],[5,8,5,11],[5,12,5,15],[5,16,5,19],[6,14,6,15],[6,16,6,17],[6,18,6,19],[6,4,6,5],[6,6,6,7],[6,8,6,9],[6,10,6,11],[6,12,6,13],[7,10,9,10],[1,0,1,15],[7,18,9,18],[7,19,9,19],[7,13,9,13],[7,14,9,14],[7,15,9,15],[7,16,9,16],[7,17,9,17],[4,4,4,11],[4,12,4,19],[7,11,9,11],[7,12,9,12],[2,0,2,15],[2,16,2,19],[1,16,1,19]]}
["jedno použití",null,null,null,null,"zpoplatněné",null,null,null,null,"neobsahují nápoje",null,null,null,null,"skupinové a přepravní",null,null,null,null,null,{"$f":"V11*V12*V13*V14*V15*V16*V17*V18*V19*V20*V21*V22*V23*V24*V25*V26*V27*V28*V29*V30*V31*V32*V33*V34*V35*V42*V43*V44*V45*V46*V47*V48*V49*V50","v":0}]
["J1-1B Obaly pro jedno použití (1) - zpoplatněné",null,null,null,null,null,null,null,null,null,null,null,null,null,null,null,{"$f":"\"IČO: \"&Úvod!C12","v":"IČO: "},null,null,null,null,0]
["Výkaz o obalech, které neobsahují nápoje (2) - skupinové a přepravní obaly uvedené na trh nebo do oběhu",null,null,null,null,null,null,null,null,null,null,null,null,null,null,null,{"$f":"Úvod!D4&Úvod!E4","v":"2. čtvrtletí roku 2025"}]
["Vyplňujte v tunách",null,null,null,"OBCHODNÍ (3)"]
[null,null,null,null,"Skupinové",null,null,null,null,null,null,null,"Přepravní"]
[null,null,null,null,"Měkké, flexibilní",null,null,null,"Pevné, pevné duté",null,null,null,"Měkké, flexibilní",null,null,null,"Pevné, pevné duté"]
[null,null,null,null,"primární (4)",null,"recyklát (5)",null,"primární (4)",null,"recyklát (5)",null,"primární (4)",null,"recyklát (5)",null,"primární (4)",null,"recyklát (5)"]
[null,null,null,null,"vyrobené, nakoupené \nv ČR","importované \ndo ČR","vyrobené, nakoupené \nv ČR","importované \ndo ČR","vyrobené, nakoupené \nv ČR","importované \ndo ČR","vyrobené, nakoupené \nv ČR","importované \ndo ČR","vyrobené, nakoupené \nv ČR","importované \ndo ČR","vyrobené, nakoupené \nv ČR","importované \ndo ČR","vyrobené, nakoupené \nv ČR","importované \ndo ČR","vyrobené, nakoupené \nv ČR","importované \ndo ČR"]
[]
[]
["Plasty","PET","transparentní (6)",null,null,null,null,null,null,null,null,null,null,null,null,null,null,null,null,null,null,{"$f":"E11*F11*G11*H11*I11*J11*K11*L11*M11*N11*O11*P11*Q11*R11*S11*T11*$V$2","v":0}]
[null,null,"barevné (7)",null,null,null,null,null,null,null,null,null,null,null,null,null,null,null,null,null,null,0]
[null,"PE","transparentní (6)",null,null,null,null,null,null,null,null,null,null,null,null,null,null,null,null,null,null,0]
[null,null,"barevné (7)",null,null,null,null,null,null,null,null,null,null,null,null,null,null,null,null,null,null,0]
[null,"PP","transparentní (6)",null,null,null,null,null,null,null,null,null,null,null,null,null,null,null,null,null,null,0]
[null,null,"barevné (7)",null,null,null,null,null,null,null,null,null,null,null,null,null,null,null,null,null,null,0]
[null,"PS","transparentní (6)",null,null,null,null,null,null,null,null,null,null,null,null,null,null,null,null,null,null,0]
[null,null,"barevné (7)",null,null,null,null,null,null,null,null,null,null,null,null,null,null,null,null,null,null,0]
[null,"XPS","transparentní (6)",null,null,null,null,null,null,null,null,null,null,null,null,null,null,null,null,null,null,0]
[null,null,"barevné (7)",null,null,null,null,null,null,null,null,null,null,null,null,null,null,null,null,null,null,0]
[null,"EPS","transparentní (6)",null,null,null,null,null,null,null,null,null,null,null,null,null,null,null,null,null,null,0]
[null,null,"barevné (7)",null,null,null,null,null,null,null,null,null,null,null,null,null,null,null,null,null,null,0]
[null,"PVC","transparentní (6)",null,null,null,null,null,null,null,null,null,null,null,null,null,null,null,null,null,null,0]
[null,null,"barevné (7)",null,null,null,null,null,null,null,null,null,null,null,null,null,null,null,null,null,null,0]
[null,"Jiné","transparentní (6)",null,null,null,null,null,null,null,null,null,null,null,null,null,null,null,null,null,null,0]
[null,null,"barevné (7)",null,null,null,null,null,null,null,null,null,null,null,null,null,null,null,null,null,null,0]
[null,"Biologicky rozložitelné (8)","transparentní (6)",null,null,null,null,null,null,null,null,null,null,null,null,null,null,null,null,null,null,0]
[null,null,"barevné (7)",null,null,null,null,null,null,null,null,null,null,null,null,null,null,null,null,null,null,0]
[null,"Kompozitní\n(9)","transparentní (6)",null,null,null,null,null,null,null,null,null,null,null,null,null,null,null,null,null,null,0]
[null,null,"barevné (7)",null,null,null,null,null,null,null,null,null,null,null,null,null,null,null,null,null,null,0]
["Kovy","Al",null,null,null,null,null,null,null,null,null,null,null,null,null,null,null,null,null,null,null,0]
[null,"Fe","FE",null,null,null,null,null,null,null,null,null,null,null,null,null,null,null,null,null,null,0]
[null,"Kompozitní Al (9)",null,null,null,null,null,null,null,null,null,null,null,null,null,null,null,null,null,null,null,0]
[null,"Kompozitní Fe (9)",null,null,null,null,null,null,null,null,null,null,null,null,null,null,null,null,null,null,null,0]
["Kompozitní materiál (9)",null,null,null,null,null,null,null,null,null,null,null,null,null,null,null,null,null,null,null,null,0]
[]
["Vyplňujte v tunách",null,null,null,"Skupinové",null,null,null,null,null,null,null,"Přepravní"]
[null,null,null,null,"primární (4)",null,null,null,"recyklát (5)",null,null,null,"primární (4)",null,null,null,"recyklát (5)"]
[null,null,null,null,"vyrobené, nakoupené \nv ČR",null,"importované \ndo ČR",null,"vyrobené, nakoupené \nv ČR",null,"importované \ndo ČR",null,"vyrobené, nakoupené \nv ČR",null,"importované \ndo ČR",null,"vyrobené, nakoupené \nv ČR",null,"importované \ndo ČR"]
[]
[]
["Papír","Papír",null,null,null,null,null,null,null,null,null,null,null,null,null,null,null,null,null,null,null,{"$f":"E42*G42*I42*K42*M42*O42*Q42*S42*$V$2","v":0}]
[null,"Hladká lepenka",null,null,null,null,null,null,null,null,null,null,null,null,null,null,null,null,null,null,null,0]
[null,"Vlnitá lepenka",null,null,null,null,null,null,null,null,null,null,null,null,null,null,null,null,null,null,null,0]
[null,"Nasávaná kartonáž",null,null,null,null,null,null,null,null,null,null,null,null,null,null,null,null,null,null,null,0]
[null,"Kompozitní (9)",null,null,null,null,null,null,null,null,null,null,null,null,null,null,null,null,null,null,null,0]
["Dřevo","Dřevo a dřevotříska",null,null,null,null,null,null,null,null,null,null,null,null,null,null,null,null,null,null,null,0]
[null,"Kompozit \ns nedřevěnými částmi (9)",null,null,null,null,null,null,null,null,null,null,null,null,null,null,null,null,null,null,null,0]
["Textil",null,null,null,null,null,null,null,null,null,null,null,null,null,null,null,null,null,null,null,null,0]
["Jiné",null,null,null,null,null,null,null,null,null,null,null,null,null,null,null,null,null,null,null,null,0]
[]
["1) Obaly, které nevyhovují kritériím § 13 odst. 3 zákona č. 477/2001 Sb., o obalech."]
["2) Obaly, které nevyhovují kritériím uvedeným ve směrnici EU 2019/904 odst. 12."]
["3) Obaly, které nevyhovují § 2 písm. q)  zákona č. 477/2001 Sb., o obalech."]
["4) Množství primární suroviny v obalu."]
["5) Prokazatelné množství recyklovaného materiálu v obalu."]
["6) Obaly, čiré bez viditelného zabarvení."]
["7) Obaly, průhledné se zabarvením či zcela probarvené."]
["8) Biologickým rozkladem je aerobní nebo anaerobní rozklad odpadů z obalů; oxo-rozložitelný plastový obal se nepovažuje za obal rozložitelný biologickým rozkladem."]
["9) Pokračujte ve vyplňovaní na listu J1-1K."]

{"sheet":"J1-1K","index":6,"n_rows":26,"n_cols":16,"rows_kept":26,"cut":false,"hidden":false,"merged":[[4,0,8,3],[5,4,5,5],[5,6,5,7],[5,8,5,9],[6,4,8,4],[6,5,8,5],[6,6,8,6],[6,7,8,7],[6,8,8,8],[6,9,8,9],[4,4,4,9],[20,0,20,3],[17,0,17,3],[18,0,18,3],[15,0,16,1],[9,0,14,1],[9,2,9,3],[10,2,10,3],[11,2,11,3],[12,2,12,3],[13,2,13,3],[14,2,14,3],[15,2,15,3],[16,2,16,3],[19,0,19,3],[0,11,0,13],[2,0,3,9],[0,4,0,5],[0,6,0,7],[0,8,0,10],[0,0,0,3],[1,0,1,8],[1,10,1,13],[2,10,2,13]]}
["jedno použití",null,null,null,"zpoplatněné",null,"neobsahují nápoje",null,"prodejní, skupinové a přepravní",null,null,"kompozitní",null,null,null,{"$f":"P10*P11*P12*P13*P14*P15*P16*P17*P18*P19*P20*P21","v":0}]
["J1-1K Obaly a obalové prostředky pro jedno použití (1) - zpoplatněné",null,null,null,null,null,null,null,null,null,{"$f":"\"IČO: \"&Úvod!C12","v":"IČO: "},null,null,null,null,0]
["Doplňující výkaz o obalech, které neobsahují nápoje (2) - prodejní, skupinové a přepravní \n- kompozitní obaly uvedené na trh nebo do oběhu",null,null,null,null,null,null,null,null,null,{"$f":"Úvod!D4&Úvod!E4","v":"2. čtvrtletí roku 2025"}]
[]
["Vyplňujte v tunách",null,null,null,"OBCHODNÍ (3)"]
[null,null,null,null,"Prodejní",null,"Skupinové",null,"Přepravní"]
[null,null,null,null,"vyrobené, nakoupené \nv ČR","importované \ndo ČR","vyrobené, nakoupené \nv ČR","importované \ndo ČR","vyrobené, nakoupené \nv ČR","importované \ndo ČR"]
[]
[]
["Plasty",null,"PET",null,null,null,null,null,null,null,null,null,null,null,null,{"$f":"E10*F10*G10*H10*I10*J10*$P$2","v":0}]
[null,null,"PE",null,null,null,null,null,null,null,null,null,null,null,null,0]
[null,null,"PP",null,null,null,null,null,null,null,null,null,null,null,null,0]
[null,null,"PS",null,null,null,null,null,null,null,null,null,null,null,null,0]
[null,null,"PVC",null,null,null,null,null,null,null,null,null,null,null,null,0]
[null,null,"Jiné",null,null,null,null,null,null,null,null,null,null,null,null,0]
["Kovy",null,"Al",null,null,null,null,null,null,null,null,null,null,null,null,0]
[null,null,"Fe",null,null,null,null,null,null,null,null,null,null,null,null,0]
["Sklo",null,null,null,null,null,null,null,null,null,null,null,null,null,null,0]
["Papír a vlnitá lepenka",null,null,null,null,null,null,null,null,null,null,null,null,null,null,0]
["Dřevo",null,null,null,null,null,null,null,null,null,null,null,null,null,null,0]
["Jiné",null,null,null,null,null,null,null,null,null,null,null,null,null,null,0]
[]
["1) Obaly, které nevyhovují kritériím § 13 odst. 3 zákona č. 477/2001 Sb., o obalech, a obaly a obalové prostředky uvedené v části D přílohy č. 4 \n  "]
["    k zákonu č. 477/2001 Sb., o obalech."]
["2) Obaly, které nevyhovují kritériím uvedeným ve směrnici EU 2019/904 odst. 12."]
["3) Obaly, které nevyhovují § 2 písm. q)  zákona č. 477/2001 Sb., o obalech."]

{"sheet":"J1-2A","index":7,"n_rows":65,"n_cols":18,"rows_kept":65,"cut":false,"hidden":false,"merged":[[1,13,1,15],[0,0,0,3],[0,8,0,11],[0,4,0,7],[0,12,0,15],[1,0,1,12],[2,0,2,12],[2,13,2,15],[3,0,8,3],[3,4,3,15],[4,4,4,7],[4,8,4,11],[4,12,4,15],[5,4,5,5],[5,6,5,7],[5,8,5,9],[5,10,5,11],[5,12,5,13],[5,14,5,15],[6,4,8,4],[6,5,8,5],[6,6,8,6],[6,7,8,7],[6,8,8,8],[6,12,8,12],[6,13,8,13],[6,14,8,14],[6,15,8,15],[9,0,29,0],[9,1,11,1],[9,2,9,3],[10,2,10,3],[11,2,11,3],[16,1,17,1],[16,2,16,3],[17,2,17,3],[18,1,19,1],[18,2,18,3],[19,2,19,3],[12,1,13,1],[12,2,12,3],[13,2,13,3],[14,1,15,1],[14,2,14,3],[15,2,15,3],[20,1,21,1],[20,2,20,3],[21,2,21,3],[22,1,23,1],[22,2,22,3],[23,2,23,3],[6,9,8,9],[6,10,8,10],[6,11,8,11],[28,1,29,1],[29,2,29,3],[30,0,33,0],[30,1,30,3],[31,1,31,3],[32,1,32,3],[33,1,33,3],[24,1,25,1],[24,2,24,3],[25,2,25,3],[26,1,27,1],[26,2,26,3],[27,2,27,3],[34,0,34,3],[34,4,34,7],[35,0,35,3],[37,0,39,3],[37,4,37,7],[37,8,37,11],[38,4,39,5],[38,6,39,7],[38,8,39,9],[41,8,41,9],[41,10,41,11],[42,1,42,3],[42,4,42,5],[42,6,42,7],[42,8,42,9],[42,10,42,11],[38,10,39,11],[40,0,42,0],[40,1,40,3],[40,4,40,5],[40,6,40,7],[40,8,40,9],[40,10,40,11],[41,1,41,3],[41,4,41,5],[41,6,41,7],[44,10,44,11],[45,1,45,3],[45,4,45,5],[45,6,45,7],[45,8,45,9],[45,10,45,11],[43,0,47,0],[43,1,43,3],[43,4,43,5],[43,6,43,7],[43,8,43,9],[43,10,43,11],[44,1,44,3],[44,4,44,5],[44,6,44,7],[44,8,44,9],[46,1,46,3],[46,4,46,5],[46,6,46,7],[46,8,46,9],[46,10,46,11],[47,1,47,3],[47,4,47,5],[47,6,47,7],[47,8,47,9],[47,10,47,11],[51,0,51,3],[51,4,51,5],[51,6,51,7],[51,8,51,9],[51,10,51,11],[49,10,49,11],[50,0,50,3],[50,4,50,5],[50,6,50,7],[50,8,50,9],[50,10,50,11],[48,0,49,0],[48,1,48,3],[48,4,48,5],[48,6,48,7],[48,8,48,9],[48,10,48,11],[49,1,49,3],[49,4,49,5],[49,6,49,7],[49,8,49,9]]}
["jedno použití",null,null,null,"zpoplatněné",null,null,null,"obsahují nápoje",null,null,null,"prodejní",null,null,null,null,{"$f":"R10*R11*R12*R13*R14*R15*R16*R17*R18*R19*R20*R21*R22*R23*R24*R25*R26*R27*R28*R29*R30*R31*R32*R33*R34*R35*R36*R41*R42*R43*R44*R45*R46*R47*R48*R49*R50*R51*R52","v":0}]
["J1-2A Obaly a obalové prostředky pro jedno použití (1) - zpoplatněné",null,null,null,null,null,null,null,null,null,null,null,null,{"$f":"\"IČO: \"&Úvod!C12","v":"IČO: "},null,null,null,0]
["Výkaz o obalech, které obsahují nápoje (2) - prodejní obaly a obalové prostředky uvedené na trh nebo do oběhu",null,null,null,null,null,null,null,null,null,null,null,null,{"$f":"Úvod!D4&Úvod!E4","v":"2. čtvrtletí roku 2025"}]
["Vyplňujte v tunách",null,null,null,"OBCHODNÍ (3) - Prodejní"]
[null,null,null,null,"Měkké, flexibilní",null,null,null,"Pevné, pevné duté do 3 L ",null,null,null,"Pevné duté nad 3 L "]
[null,null,null,null,"primární (4)",null,"recyklát (5)",null,"primární (4)",null,"recyklát (5)",null,"primární (4)",null,"recyklát (5)"]
[null,null,null,null,"vyrobené, nakoupené \nv ČR","importované \ndo ČR","vyrobené, nakoupené \nv ČR","importované \ndo ČR","vyrobené, nakoupené \nv ČR","importované \ndo ČR","vyrobené, nakoupené \nv ČR","importované \ndo ČR","vyrobené, nakoupené \nv ČR","importované \ndo ČR","vyrobené, nakoupené \nv ČR","importované \ndo ČR"]
[]
[]
["Plasty","PET","transparentní (6)",null,null,null,null,null,null,null,null,null,null,null,null,null,null,{"$f":"E10*F10*G10*H10*I10*J10*K10*L10*M10*N10*O10*P10*$R$2","v":0}]
[null,null,"průhledné barevné (8)",null,null,null,null,null,null,null,null,null,null,null,null,null,null,0]
[null,null,"neprůhledné barevné (9)",null,null,null,null,null,null,null,null,null,null,null,null,null,null,0]
[null,"PE","transparentní (6)",null,null,null,null,null,null,null,null,null,null,null,null,null,null,0]
[null,null,"barevné (7)",null,null,null,null,null,null,null,null,null,null,null,null,null,null,0]
[null,"PP","transparentní (6)",null,null,null,null,null,null,null,null,null,null,null,null,null,null,0]
[null,null,"barevné (7)",null,null,null,null,null,null,null,null,null,null,null,null,null,null,0]
[null,"PS","transparentní (6)",null,null,null,null,null,null,null,null,null,null,null,null,null,null,0]
[null,null,"barevné (7)",null,null,null,null,null,null,null,null,null,null,null,null,null,null,0]
[null,"XPS","transparentní (6)",null,null,null,null,null,null,null,null,null,null,null,null,null,null,0]
[null,null,"barevné (7)",null,null,null,null,null,null,null,null,null,null,null,null,null,null,0]
[null,"EPS","transparentní (6)",null,null,null,null,null,null,null,null,null,null,null,null,null,null,0]
[null,null,"barevné (7)",null,null,null,null,null,null,null,null,null,null,null,null,null,null,0]
[null,"PVC","transparentní (6)",null,null,null,null,null,null,null,null,null,null,null,null,null,null,0]
[null,null,"barevné (7)",null,null,null,null,null,null,null,null,null,null,null,null,null,null,0]
[null,"Jiné","transparentní (6)",null,null,null,null,null,null,null,null,null,null,null,null,null,null,0]
[null,null,"barevné (7)",null,null,null,null,null,null,null,null,null,null,null,null,null,null,0]
[null,"Biologicky rozložitelné (11)","transparentní (6)",null,null,null,null,null,null,null,null,null,null,null,null,null,null,0]
[null,null,"barevné (7)",null,null,null,null,null,null,null,null,null,null,null,null,null,null,0]
[null,"Kompozitní \n(10)","transparentní (6)",null,null,null,null,null,null,null,null,null,null,null,null,null,null,{"$f":"E29*F29*G29*H29*I29*J29*K29*L29*M29*N29*O29*P29*$R$2","v":0}]
[null,null,"barevné (7)",null,null,null,null,null,null,null,null,null,null,null,null,null,null,0]
["Kovy","Al",null,null,null,null,null,null,null,null,null,null,null,null,null,null,null,0]
[null,"Fe","FE",null,null,null,null,null,null,null,null,null,null,null,null,null,null,0]
[null,"Kompozitní Al (10)",null,null,null,null,null,null,null,null,null,null,null,null,null,null,null,0]
[null,"Kompozitní Fe (10)",null,null,null,null,null,null,null,null,null,null,null,null,null,null,null,0]
["Nápojový karton (2,10)",null,null,null,null,null,null,null,null,null,null,null,null,null,null,null,null,0]
["Kompozitní materiál (10)",null,null,null,null,null,null,null,null,null,null,null,null,null,null,null,null,0]
[]
["Vyplňujte v tunách",null,null,null,"primární (4)",null,null,null,"recyklát (5)"]
[null,null,null,null,"vyrobené, nakoupené \nv ČR",null,"importované \ndo ČR",null,"vyrobené, nakoupené \nv ČR",null,"importované \ndo ČR"]
[]
["Sklo","Transparentní (6)",null,null,null,null,null,null,null,null,null,null,null,null,null,null,null,{"$f":"E41*G41*I41*K41*$R$2","v":0}]
[null,"Barevné (7)",null,null,null,null,null,null,null,null,null,null,null,null,null,null,null,0]
[null,"Kompozitní (10)",null,null,null,null,null,null,null,null,null,null,null,null,null,null,null,0]
["Papír","Papír",null,null,null,null,null,null,null,null,null,null,null,null,null,null,null,0]
[null,"Hladká lepenka",null,null,null,null,null,null,null,null,null,null,null,null,null,null,null,0]
[null,"Vlnitá lepenka",null,null,null,null,null,null,null,null,null,null,null,null,null,null,null,0]
[null,"Nasávaná kartonáž",null,null,null,null,null,null,null,null,null,null,null,null,null,null,null,0]
[null,"Kompozitní (10)",null,null,null,null,null,null,null,null,null,null,null,null,null,null,null,0]
["Dřevo","Dřevo a dřevotříska",null,null,null,null,null,null,null,null,null,null,null,null,null,null,null,0]
[null,"Kompozit s nedřevěnými částmi (10)",null,null,null,null,null,null,null,null,null,null,null,null,null,null,null,0]
["Textil",null,null,null,null,null,null,null,null,null,null,null,null,null,null,null,null,0]
["Jiné",null,null,null,null,null,null,null,null,null,null,null,null,null,null,null,null,0]
[]
["1) Obaly, které nevyhovují kritériím § 13 odst. 3 zákona č. 477/2001 Sb., o obalech, a obaly a obalové prostředky uvedené v části D přílohy č. 4 \n  "]
["    k zákonu č. 477/2001 Sb., o obalech."]
["2) Obaly, které vyhovují kritériím uvedeným ve směrnici EU 2019/904 odst. 12."]
["3) Obaly, které nevyhovují § 2 písm. q)  zákona č. 477/2001 Sb., o obalech."]
["4) Množství primární suroviny v obalu."]
["5) Prokazatelné množství recyklovaného materiálu v obalu."]
["6) Obaly, čiré bez viditelného zabarvení."]
["7) Obaly, průhledné se zabarvením či zcela probarvené."]
["8) Obaly z PET, průhledné se zabarvením."]
["9) Obaly z PET, zcela probarvené."]
["10) Pokračujte ve vyplňovaní na listu J1-2K."]
["11) Biologickým rozkladem je aerobní nebo anaerobní rozklad odpadů z obalů; oxo-rozložitelný plastový obal se nepovažuje za obal rozložitelný biologickým rozkladem."]

{"sheet":"J1-2B","index":8,"n_rows":60,"n_cols":22,"rows_kept":60,"cut":false,"hidden":false,"merged":[[2,0,2,15],[1,16,1,19],[2,16,2,19],[49,4,49,5],[49,6,49,7],[49,8,49,9],[49,10,49,11],[49,12,49,13],[49,14,49,15],[49,16,49,17],[49,18,49,19],[47,4,47,5],[47,6,47,7],[47,8,47,9],[47,10,47,11],[47,12,47,13],[47,14,47,15],[47,16,47,17],[47,18,47,19],[48,4,48,5],[48,6,48,7],[48,8,48,9],[48,10,48,11],[48,12,48,13],[48,14,48,15],[48,16,48,17],[48,18,48,19],[45,12,45,13],[45,14,45,15],[45,16,45,17],[45,18,45,19],[46,4,46,5],[46,6,46,7],[46,8,46,9],[46,10,46,11],[46,12,46,13],[46,14,46,15],[46,16,46,17],[46,18,46,19],[43,12,43,13],[43,14,43,15],[43,16,43,17],[43,18,43,19],[44,4,44,5],[44,6,44,7],[44,8,44,9],[44,10,44,11],[44,12,44,13],[44,14,44,15],[44,16,44,17],[44,18,44,19],[41,12,41,13],[41,14,41,15],[41,16,41,17],[41,18,41,19],[42,4,42,5],[42,6,42,7],[42,8,42,9],[42,10,42,11],[42,12,42,13],[42,14,42,15],[42,16,42,17],[42,18,42,19],[36,12,36,19],[37,4,37,7],[37,8,37,11],[37,12,37,15],[37,16,37,19],[38,4,40,5],[38,6,40,7],[38,8,40,9],[38,10,40,11],[38,12,40,13],[38,14,40,15],[38,16,40,17],[38,18,40,19],[0,0,0,4],[0,10,0,14],[0,5,0,9],[0,15,0,19],[1,0,1,15],[6,14,6,15],[6,16,6,17],[6,18,6,19],[3,0,9,3],[3,4,3,19],[4,4,4,11],[4,12,4,19],[5,4,5,7],[5,8,5,11],[5,12,5,15],[5,16,5,19],[6,4,6,5],[6,6,6,7],[7,9,9,9],[6,8,6,9],[6,10,6,11],[6,12,6,13],[7,18,9,18],[7,19,9,19],[10,0,29,0],[10,1,11,1],[10,2,10,3],[11,2,11,3],[12,1,13,1],[12,2,12,3],[7,10,9,10],[7,11,9,11],[7,12,9,12],[26,1,27,1],[26,2,26,3],[27,2,27,3],[28,1,29,1],[29,2,29,3],[7,4,9,4],[7,5,9,5],[7,6,9,6],[7,7,9,7],[7,8,9,8],[7,16,9,16],[7,17,9,17],[22,1,23,1],[22,2,22,3],[23,2,23,3],[24,1,25,1],[24,2,24,3],[25,2,25,3],[18,1,19,1],[18,2,18,3],[19,2,19,3],[20,1,21,1],[20,2,20,3],[21,2,21,3],[7,14,9,14],[7,15,9,15],[13,2,13,3],[14,1,15,1],[14,2,14,3],[15,2,15,3],[16,1,17,1],[16,2,16,3],[17,2,17,3],[7,13,9,13],[30,0,33,0],[30,1,30,3],[31,1,31,3],[32,1,32,3],[33,1,33,3],[34,0,34,3],[36,0,40,3],[36,4,36,11],[48,0,48,3],[41,4,41,5],[41,6,41,7],[41,8,41,9],[41,10,41,11],[43,4,43,5],[43,6,43,7],[43,8,43,9],[43,10,43,11],[45,4,45,5],[45,6,45,7],[45,8,45,9],[45,10,45,11],[49,0,49,3],[41,0,45,0],[41,1,41,3],[43,1,43,3],[44,1,44,3],[45,1,45,3],[46,0,47,0],[46,1,46,3],[47,1,47,3]]}
["jedno použití",null,null,null,null,"zpoplatněné",null,null,null,null,"obsahují nápoje",null,null,null,null,"skupinové a přepravní",null,null,null,null,null,{"$f":"V11*V12*V13*V14*V15*V16*V17*V18*V19*V20*V21*V22*V23*V24*V25*V26*V27*V28*V29*V30*V31*V32*V33*V34*V35*V42*V43*V44*V45*V46*V47*V48*V49*V50","v":0}]
["J1-2B Obaly pro jedno použití (1) - zpoplatněné",null,null,null,null,null,null,null,null,null,null,null,null,null,null,null,{"$f":"\"IČO: \"&Úvod!C12","v":"IČO: "},null,null,null,null,0]
["Výkaz o obalech, které obsahují nápoje (2) - skupinové a přepravní obaly uvedené na trh nebo do oběhu",null,null,null,null,null,null,null,null,null,null,null,null,null,null,null,{"$f":"Úvod!D4&Úvod!E4","v":"2. čtvrtletí roku 2025"}]
["Vyplňujte v tunách",null,null,null,"OBCHODNÍ (3)"]
[null,null,null,null,"Skupinové",null,null,null,null,null,null,null,"Přepravní"]
[null,null,null,null,"Měkké, flexibilní",null,null,null,"Pevné, pevné duté",null,null,null,"Měkké, flexibilní",null,null,null,"Pevné, pevné duté"]
[null,null,null,null,"primární (4)",null,"recyklát (5)",null,"primární (4)",null,"recyklát (5)",null,"primární (4)",null,"recyklát (5)",null,"primární (4)",null,"recyklát (5)"]
[null,null,null,null,"vyrobené, nakoupené \nv ČR","importované \ndo ČR","vyrobené, nakoupené \nv ČR","importované \ndo ČR","vyrobené, nakoupené \nv ČR","importované \ndo ČR","vyrobené, nakoupené \nv ČR","importované \ndo ČR","vyrobené, nakoupené \nv ČR","importované \ndo ČR","vyrobené, nakoupené \nv ČR","importované \ndo ČR","vyrobené, nakoupené \nv ČR","importované \ndo ČR","vyrobené, nakoupené \nv ČR","importované \ndo ČR"]
[]
[]
["Plasty","PET","transparentní (6)",null,null,null,null,null,null,null,null,null,null,null,null,null,null,null,null,null,null,{"$f":"E11*F11*G11*H11*I11*J11*K11*L11*M11*N11*O11*P11*Q11*R11*S11*T11*$V$2","v":0}]
[null,null,"barevné (7)",null,null,null,null,null,null,null,null,null,null,null,null,null,null,null,null,null,null,0]
[null,"PE","transparentní (6)",null,null,null,null,null,null,null,null,null,null,null,null,null,null,null,null,null,null,0]
[null,null,"barevné (7)",null,null,null,null,null,null,null,null,null,null,null,null,null,null,null,null,null,null,0]
[null,"PP","transparentní (6)",null,null,null,null,null,null,null,null,null,null,null,null,null,null,null,null,null,null,0]
[null,null,"barevné (7)",null,null,null,null,null,null,null,null,null,null,null,null,null,null,null,null,null,null,0]
[null,"PS","transparentní (6)",null,null,null,null,null,null,null,null,null,null,null,null,null,null,null,null,null,null,0]
[null,null,"barevné (7)",null,null,null,null,null,null,null,null,null,null,null,null,null,null,null,null,null,null,0]
[null,"XPS","transparentní (6)",null,null,null,null,null,null,null,null,null,null,null,null,null,null,null,null,null,null,0]
[null,null,"barevné (7)",null,null,null,null,null,null,null,null,null,null,null,null,null,null,null,null,null,null,0]
[null,"EPS","transparentní (6)",null,null,null,null,null,null,null,null,null,null,null,null,null,null,null,null,null,null,0]
[null,null,"barevné (7)",null,null,null,null,null,null,null,null,null,null,null,null,null,null,null,null,null,null,0]
[null,"PVC","transparentní (6)",null,null,null,null,null,null,null,null,null,null,null,null,null,null,null,null,null,null,0]
[null,null,"barevné (7)",null,null,null,null,null,null,null,null,null,null,null,null,null,null,null,null,null,null,0]
[null,"Jiné","transparentní (6)",null,null,null,null,null,null,null,null,null,null,null,null,null,null,null,null,null,null,0]
[null,null,"barevné (7)",null,null,null,null,null,null,null,null,null,null,null,null,null,null,null,null,null,null,0]
[null,"Biologicky rozložitelné (8)","transparentní (6)",null,null,null,null,null,null,null,null,null,null,null,null,null,null,null,null,null,null,0]
[null,null,"barevné (7)",null,null,null,null,null,null,null,null,null,null,null,null,null,null,null,null,null,null,0]
[null,"Kompozitní (9)","transparentní (6)",null,null,null,null,null,null,null,null,null,null,null,null,null,null,null,null,null,null,0]
[null,null,"barevné (7)",null,null,null,null,null,null,null,null,null,null,null,null,null,null,null,null,null,null,0]
["Kovy","Al",null,null,null,null,null,null,null,null,null,null,null,null,null,null,null,null,null,null,null,0]
[null,"Fe","FE",null,null,null,null,null,null,null,null,null,null,null,null,null,null,null,null,null,null,0]
[null,"Kompozitní Al (9)",null,null,null,null,null,null,null,null,null,null,null,null,null,null,null,null,null,null,null,0]
[null,"Kompozitní Fe (9)",null,null,null,null,null,null,null,null,null,null,null,null,null,null,null,null,null,null,null,0]
["Kompozitní materiál (9)",null,null,null,null,null,null,null,null,null,null,null,null,null,null,null,null,null,null,null,null,0]
[]
["Vyplňujte v tunách",null,null,null,"Skupinové",null,null,null,null,null,null,null,"Přepravní"]
[null,null,null,null,"primární (4)",null,null,null,"recyklát (5)",null,null,null,"primární (4)",null,null,null,"recyklát (5)"]
[null,null,null,null,"vyrobené, nakoupené \nv ČR",null,"importované \ndo ČR",null,"vyrobené, nakoupené \nv ČR",null,"importované \ndo ČR",null,"vyrobené, nakoupené \nv ČR",null,"importované \ndo ČR",null,"vyrobené, nakoupené \nv ČR",null,"importované \ndo ČR"]
[]
[]
["Papír","Papír",null,null,null,null,null,null,null,null,null,null,null,null,null,null,null,null,null,null,null,{"$f":"E42*G42*I42*K42*M42*O42*Q42*S42*$V$2","v":0}]
[null,"Hladká lepenka",null,null,null,null,null,null,null,null,null,null,null,null,null,null,null,null,null,null,null,0]
[null,"Vlnitá lepenka",null,null,null,null,null,null,null,null,null,null,null,null,null,null,null,null,null,null,null,0]
[null,"Nasávaná kartonáž",null,null,null,null,null,null,null,null,null,null,null,null,null,null,null,null,null,null,null,0]
[null,"Kompozitní (9)",null,null,null,null,null,null,null,null,null,null,null,null,null,null,null,null,null,null,null,0]
["Dřevo","Dřevo a dřevotříska",null,null,null,null,null,null,null,null,null,null,null,null,null,null,null,null,null,null,null,0]
[null,"Kompozit \ns nedřevěnými částmi (9)",null,null,null,null,null,null,null,null,null,null,null,null,null,null,null,null,null,null,null,0]
["Textil",null,null,null,null,null,null,null,null,null,null,null,null,null,null,null,null,null,null,null,null,0]
["Jiné",null,null,null,null,null,null,null,null,null,null,null,null,null,null,null,null,null,null,null,null,0]
[]
["1) Obaly, které nevyhovují kritériím § 13 odst. 3 zákona č. 477/2001 Sb., o obalech."]
["2) Obaly, které vyhovují kritériím uvedeným ve směrnici EU 2019/904 odst. 12."]
["3) Obaly, které nevyhovují § 2 písm. q)  zákona č. 477/2001 Sb., o obalech."]
["4) Množství primární suroviny v obalu."]
["5) Prokazatelné množství recyklovaného materiálu v obalu."]
["6) Obaly, čiré bez viditelného zabarvení."]
["7) Obaly, průhledné se zabarvením či zcela probarvené."]
["8) Biologickým rozkladem je aerobní nebo anaerobní rozklad odpadů z obalů; oxo-rozložitelný plastový obal se nepovažuje za obal rozložitelný biologickým rozkladem."]
["9) Pokračujte ve vyplňovaní na listu J1-2K."]

{"sheet":"J1-2K","index":9,"n_rows":26,"n_cols":16,"rows_kept":26,"cut":false,"hidden":false,"merged":[[1,10,1,13],[2,10,2,13],[0,0,0,3],[0,4,0,5],[0,6,0,7],[0,8,0,10],[0,11,0,13],[1,0,1,8],[2,0,3,9],[18,0,18,3],[19,0,19,3],[20,0,20,3],[10,2,10,3],[11,2,11,3],[12,2,12,3],[13,2,13,3],[14,2,14,3],[15,2,15,3],[9,0,14,1],[9,2,9,3],[17,0,17,3],[16,2,16,3],[15,0,16,1],[4,0,8,3],[4,4,4,9],[5,4,5,5],[5,6,5,7],[5,8,5,9],[6,4,8,4],[6,5,8,5],[6,6,8,6],[6,7,8,7],[6,8,8,8],[6,9,8,9]]}
["jedno použití",null,null,null,"zpoplatněné",null,"obsahují nápoje",null,"prodejní, skupinové a přepravní",null,null,"kompozitní",null,null,null,{"$f":"P10*P11*P12*P13*P14*P15*P16*P17*P18*P19*P20*P21","v":0}]
["J1-2K Obaly a obalové prostředky pro jedno použití (1) - zpoplatněné",null,null,null,null,null,null,null,null,null,{"$f":"\"IČO: \"&Úvod!C12","v":"IČO: "},null,null,null,null,0]
["Doplňující výkaz o obalech, které obsahují nápoje (2) - prodejní, skupinové a přepravní \n- kompozitní obaly uvedené na trh nebo do oběhu",null,null,null,null,null,null,null,null,null,{"$f":"Úvod!D4&Úvod!E4","v":"2. čtvrtletí roku 2025"}]
[]
["Vyplňujte v tunách",null,null,null,"OBCHODNÍ (3)"]
[null,null,null,null,"Prodejní",null,"Skupinové",null,"Přepravní"]
[null,null,null,null,"vyrobené, nakoupené \nv ČR","importované \ndo ČR","vyrobené, nakoupené \nv ČR","importované \ndo ČR","vyrobené, nakoupené \nv ČR","importované \ndo ČR"]
[]
[]
["Plasty",null,"PET",null,null,null,null,null,null,null,null,null,null,null,null,{"$f":"E10*F10*G10*H10*I10*J10*$P$2","v":0}]
[null,null,"PE",null,null,null,null,null,null,null,null,null,null,null,null,0]
[null,null,"PP",null,null,null,null,null,null,null,null,null,null,null,null,0]
[null,null,"PS",null,null,null,null,null,null,null,null,null,null,null,null,0]
[null,null,"PVC",null,null,null,null,null,null,null,null,null,null,null,null,0]
[null,null,"Jiné",null,null,null,null,null,null,null,null,null,null,null,null,0]
["Kovy",null,"Al",null,null,null,null,null,null,null,null,null,null,null,null,0]
[null,null,"Fe",null,null,null,null,null,null,null,null,null,null,null,null,0]
["Sklo",null,null,null,null,null,null,null,null,null,null,null,null,null,null,0]
["Papír a vlnitá lepenka",null,null,null,null,null,null,null,null,null,null,null,null,null,null,0]
["Dřevo",null,null,null,null,null,null,null,null,null,null,null,null,null,null,0]
["Jiné",null,null,null,null,null,null,null,null,null,null,null,null,null,null,0]
[]
["1) Obaly, které nevyhovují kritériím § 13 odst. 3 zákona č. 477/2001 Sb., o obalech, a obaly a obalové prostředky uvedené v části D přílohy č. 4 \n  "]
["    k zákonu č. 477/2001 Sb., o obalech."]
["2) Obaly, které vyhovují kritériím uvedeným ve směrnici EU 2019/904 odst. 12."]
["3) Obaly, které nevyhovují § 2 písm. q)  zákona č. 477/2001 Sb., o obalech."]

{"sheet":"J1-3","index":10,"n_rows":63,"n_cols":22,"rows_kept":63,"cut":false,"hidden":false,"merged":[[2,0,2,15],[1,16,1,19],[2,16,2,19],[50,16,50,17],[51,16,51,17],[52,16,52,17],[41,18,41,19],[42,18,42,19],[43,18,43,19],[44,18,44,19],[45,18,45,19],[46,18,46,19],[47,18,47,19],[48,18,48,19],[49,18,49,19],[50,18,50,19],[51,18,51,19],[52,18,52,19],[41,16,41,17],[42,16,42,17],[43,16,43,17],[44,16,44,17],[45,16,45,17],[46,16,46,17],[50,12,50,13],[51,12,51,13],[52,12,52,13],[41,14,41,15],[42,14,42,15],[43,14,43,15],[44,14,44,15],[45,14,45,15],[46,14,46,15],[47,14,47,15],[48,14,48,15],[49,14,49,15],[50,14,50,15],[51,14,51,15],[52,14,52,15],[41,12,41,13],[42,12,42,13],[43,12,43,13],[44,12,44,13],[45,12,45,13],[46,12,46,13],[48,12,48,13],[49,12,49,13],[50,8,50,9],[51,8,51,9],[52,8,52,9],[41,10,41,11],[42,10,42,11],[43,10,43,11],[44,10,44,11],[45,10,45,11],[46,10,46,11],[47,10,47,11],[48,10,48,11],[49,10,49,11],[50,10,50,11],[51,10,51,11],[52,10,52,11],[41,8,41,9],[42,8,42,9],[43,8,43,9],[44,8,44,9],[45,8,45,9],[46,8,46,9],[48,8,48,9],[49,8,49,9],[50,4,50,5],[51,4,51,5],[52,4,52,5],[41,6,41,7],[42,6,42,7],[43,6,43,7],[44,6,44,7],[45,6,45,7],[46,6,46,7],[47,6,47,7],[48,6,48,7],[49,6,49,7],[50,6,50,7],[51,6,51,7],[52,6,52,7],[41,4,41,5],[42,4,42,5],[43,4,43,5],[44,4,44,5],[45,4,45,5],[46,4,46,5],[47,4,47,5],[48,4,48,5],[49,4,49,5],[36,12,36,19],[37,12,37,15],[37,16,37,19],[38,12,40,13],[38,14,40,15],[38,16,40,17],[38,18,40,19],[38,10,40,11],[47,8,47,9],[47,12,47,13],[47,16,47,17],[48,16,48,17],[49,16,49,17],[6,8,6,9],[6,10,6,11],[6,12,6,13],[6,14,6,15],[6,16,6,17],[6,18,6,19],[3,0,9,3],[3,4,3,19],[4,4,4,11],[4,12,4,19],[5,4,5,7],[5,8,5,11],[5,12,5,15],[5,16,5,19],[6,4,6,5],[6,6,6,7],[7,18,9,18],[7,19,9,19],[7,13,9,13],[7,14,9,14],[7,15,9,15],[7,16,9,16],[7,17,9,17],[7,10,9,10],[7,11,9,11],[7,12,9,12],[7,4,9,4],[7,5,9,5],[7,6,9,6],[7,7,9,7],[7,8,9,8],[7,9,9,9],[30,0,33,0],[30,1,30,3],[31,1,31,3],[32,1,32,3],[33,1,33,3],[24,1,25,1],[24,2,24,3],[25,2,25,3],[10,0,29,0],[10,1,11,1],[10,2,10,3],[11,2,11,3],[12,1,13,1],[12,2,12,3],[13,2,13,3],[14,1,15,1],[14,2,14,3],[15,2,15,3],[16,1,17,1],[16,2,16,3],[17,2,17,3],[22,1,23,1],[22,2,22,3],[18,1,19,1],[18,2,18,3],[19,2,19,3],[20,1,21,1],[20,2,20,3],[21,2,21,3],[38,4,40,5],[38,6,40,7],[38,8,40,9],[26,1,27,1],[26,2,26,3],[27,2,27,3],[28,1,29,1],[29,2,29,3],[23,2,23,3],[0,0,0,3],[0,4,0,8],[0,9,0,13],[0,14,0,19],[1,0,1,15],[51,0,51,3],[52,0,52,3],[41,0,43,0],[41,1,41,3],[42,1,42,3],[43,1,43,3],[44,0,48,0],[44,1,44,3],[46,1,46,3],[47,1,47,3],[48,1,48,3],[49,0,50,0],[49,1,49,3],[50,1,50,3],[34,0,34,3],[36,0,40,3],[36,4,36,11],[37,4,37,7],[37,8,37,11]]}
["jedno použití",null,null,null,"zpoplatněné",null,null,null,null,"průmyslové",null,null,null,null,"neobsahují i obsahují nápoje",null,null,null,null,null,null,{"$f":"V11*V12*V13*V14*V15*V16*V17*V18*V19*V20*V21*V22*V23*V24*V25*V26*V27*V28*V29*V30*V31*V32*V33*V34*V35*V42*V43*V44*V45*V46*V47*V48*V49*V50*V51*V52*V53","v":0}]
["J1-3 Obaly pro jedno použití (1) - zpoplatněné",null,null,null,null,null,null,null,null,null,null,null,null,null,null,null,{"$f":"\"IČO: \"&Úvod!C12","v":"IČO: "},null,null,null,null,0]
["Výkaz o obalech určených výhradně jinému konečnému uživateli, tzv. průmyslové (2)\n - uvedené na trh nebo do oběhu",null,null,null,null,null,null,null,null,null,null,null,null,null,null,null,{"$f":"Úvod!D4&Úvod!E4","v":"2. čtvrtletí roku 2025"}]
["Vyplňujte v tunách",null,null,null,"PRŮMYSLOVÉ (2)"]
[null,null,null,null,"Neobsahují nápoje (3)",null,null,null,null,null,null,null,"Obsahují nápoje"]
[null,null,null,null,"Měkké, flexibilní",null,null,null,"Pevné, pevné duté",null,null,null,"Měkké, flexibilní",null,null,null,"Pevné, pevné duté"]
[null,null,null,null,"primární (4)",null,"recyklát (5)",null,"primární (4)",null,"recyklát (5)",null,"primární (4)",null,"recyklát (5)",null,"primární (4)",null,"recyklát (5)"]
[null,null,null,null,"vyrobené, nakoupené \nv ČR","importované \ndo ČR","vyrobené, nakoupené \nv ČR","importované \ndo ČR","vyrobené, nakoupené \nv ČR","importované \ndo ČR","vyrobené, nakoupené \nv ČR","importované \ndo ČR","vyrobené, nakoupené \nv ČR","importované \ndo ČR","vyrobené, nakoupené \nv ČR","importované \ndo ČR","vyrobené, nakoupené \nv ČR","importované \ndo ČR","vyrobené, nakoupené \nv ČR","importované \ndo ČR"]
[]
[]
["Plasty","PET","transparentní (6)",null,null,null,null,null,null,null,null,null,null,null,null,null,null,null,null,null,null,{"$f":"E11*F11*G11*H11*I11*J11*K11*L11*M11*N11*O11*P11*Q11*R11*S11*T11*$V$2","v":0}]
[null,null,"barevné (7)",null,null,null,null,null,null,null,null,null,null,null,null,null,null,null,null,null,null,0]
[null,"PE","transparentní (6)",null,null,null,null,null,null,null,null,null,null,null,null,null,null,null,null,null,null,0]
[null,null,"barevné (7)",null,null,null,null,null,null,null,null,null,null,null,null,null,null,null,null,null,null,0]
[null,"PP","transparentní (6)",null,null,null,null,null,null,null,null,null,null,null,null,null,null,null,null,null,null,0]
[null,null,"barevné (7)",null,null,null,null,null,null,null,null,null,null,null,null,null,null,null,null,null,null,0]
[null,"PS","transparentní (6)",null,null,null,null,null,null,null,null,null,null,null,null,null,null,null,null,null,null,0]
[null,null,"barevné (7)",null,null,null,null,null,null,null,null,null,null,null,null,null,null,null,null,null,null,0]
[null,"XPS","transparentní (6)",null,null,null,null,null,null,null,null,null,null,null,null,null,null,null,null,null,null,0]
[null,null,"barevné (7)",null,null,null,null,null,null,null,null,null,null,null,null,null,null,null,null,null,null,0]
[null,"EPS","transparentní (6)",null,null,null,null,null,null,null,null,null,null,null,null,null,null,null,null,null,null,0]
[null,null,"barevné (7)",null,null,null,null,null,null,null,null,null,null,null,null,null,null,null,null,null,null,0]
[null,"PVC","transparentní (6)",null,null,null,null,null,null,null,null,null,null,null,null,null,null,null,null,null,null,0]
[null,null,"barevné (7)",null,null,null,null,null,null,null,null,null,null,null,null,null,null,null,null,null,null,0]
[null,"Jiné","transparentní (6)",null,null,null,null,null,null,null,null,null,null,null,null,null,null,null,null,null,null,0]
[null,null,"barevné (7)",null,null,null,null,null,null,null,null,null,null,null,null,null,null,null,null,null,null,0]
[null,"Biologicky rozložitelné (8)","transparentní (6)",null,null,null,null,null,null,null,null,null,null,null,null,null,null,null,null,null,null,0]
[null,null,"barevné (7)",null,null,null,null,null,null,null,null,null,null,null,null,null,null,null,null,null,null,0]
[null,"Kompozitní \n(9)","transparentní (6)",null,null,null,null,null,null,null,null,null,null,null,null,null,null,null,null,null,null,0]
[null,null,"barevné (7)",null,null,null,null,null,null,null,null,null,null,null,null,null,null,null,null,null,null,0]
["Kovy","Al",null,null,null,null,null,null,null,null,null,null,null,null,null,null,null,null,null,null,null,0]
[null,"Fe","FE",null,null,null,null,null,null,null,null,null,null,null,null,null,null,null,null,null,null,0]
[null,"Kompozitní Al (9)",null,null,null,null,null,null,null,null,null,null,null,null,null,null,null,null,null,null,null,0]
[null,"Kompozitní Fe (9)",null,null,null,null,null,null,null,null,null,null,null,null,null,null,null,null,null,null,null,0]
["Kompozitní materiál (9)",null,null,null,null,null,null,null,null,null,null,null,null,null,null,null,null,null,null,null,null,0]
[]
["Vyplňujte v tunách",null,null,null,"Neobsahují nápoje (3)",null,null,null,null,null,null,null,"Obsahují nápoje"]
[null,null,null,null,"primární (4)",null,null,null,"recyklát (5)",null,null,null,"primární (4)",null,null,null,"recyklát (5)"]
[null,null,null,null,"vyrobené, nakoupené \nv ČR",null,"importované \ndo ČR",null,"vyrobené, nakoupené \nv ČR",null,"importované \ndo ČR",null,"vyrobené, nakoupené \nv ČR",null,"importované \ndo ČR",null,"vyrobené, nakoupené \nv ČR",null,"importované \ndo ČR"]
[]
[]
["Sklo","Transparentní (6)",null,null,null,null,null,null,null,null,null,null,null,null,null,null,null,null,null,null,null,{"$f":"E42*G42*I42*K42*M42*O42*Q42*S42*$V$2","v":0}]
[null,"Barevné (7)",null,null,null,null,null,null,null,null,null,null,null,null,null,null,null,null,null,null,null,0]
[null,"Kompozitní (9)",null,null,null,null,null,null,null,null,null,null,null,null,null,null,null,null,null,null,null,0]
["Papír","Papír",null,null,null,null,null,null,null,null,null,null,null,null,null,null,null,null,null,null,null,0]
[null,"Hladká lepenka",null,null,null,null,null,null,null,null,null,null,null,null,null,null,null,null,null,null,null,0]
[null,"Vlnitá lepenka",null,null,null,null,null,null,null,null,null,null,null,null,null,null,null,null,null,null,null,0]
[null,"Nasávaná kartonáž",null,null,null,null,null,null,null,null,null,null,null,null,null,null,null,null,null,null,null,0]
[null,"Kompozitní (9)",null,null,null,null,null,null,null,null,null,null,null,null,null,null,null,null,null,null,null,0]
["Dřevo","Dřevo a dřevotříska",null,null,null,null,null,null,null,null,null,null,null,null,null,null,null,null,null,null,null,0]
[null,"Kompozit s nedřevěnými \nčástmi (9)",null,null,null,null,null,null,null,null,null,null,null,null,null,null,null,null,null,null,null,0]
["Textil",null,null,null,null,null,null,null,null,null,null,null,null,null,null,null,null,null,null,null,null,0]
["Jiné",null,null,null,null,null,null,null,null,null,null,null,null,null,null,null,null,null,null,null,null,0]
[]
["1) Obaly, které nevyhovují kritériím § 13 odst. 3 zákona č. 477/2001 Sb., o obalech."]
["2) Obaly, které vyhovují § 2 písm. q) zákona č. 477/2001 Sb., o obalech."]
["3) Obaly, které nevyhovují kritériím uvedeným ve směrnici EU 2019/904 odst. 12."]
["4) Množství primární suroviny v obalu."]
["5) Prokazatelné množství recyklovaného materiálu v obalu."]
["6) Obaly, čiré bez viditelného zabarvení."]
["7) Obaly, průhledné se zabarvením či zcela probarvené."]
["8) Biologickým rozkladem je aerobní nebo anaerobní rozklad odpadů z obalů; oxo-rozložitelný plastový obal se nepovažuje za obal rozložitelný biologickým rozkladem."]
["9) Pokračujte ve vyplňovaní na listu J1-3K."]

{"sheet":"J1-3K","index":11,"n_rows":26,"n_cols":18,"rows_kept":26,"cut":false,"hidden":false,"merged":[[21,0,21,3],[4,4,4,7],[5,4,6,5],[5,6,6,7],[16,0,17,1],[16,2,16,3],[17,2,17,3],[18,0,18,3],[19,0,19,3],[20,0,20,3],[10,0,15,1],[10,2,10,3],[11,2,11,3],[4,0,9,3],[7,4,9,4],[7,5,9,5],[12,2,12,3],[14,2,14,3],[15,2,15,3],[0,13,0,15],[7,6,9,6],[7,7,9,7],[13,2,13,3],[1,0,1,8],[2,0,3,11],[0,0,0,3],[0,4,0,5],[0,6,0,7],[0,8,0,12],[1,12,1,15],[2,12,2,15]]}
["jedno použití",null,null,null,"zpoplatněné",null,"průmyslové",null,"neobsahují i obsahují nápoje",null,null,null,null,"kompozitní",null,null,null,{"$f":"R11*R12*R13*R14*R15*R16*R17*R18*R19*R20*R21*R22","v":0}]
["J1-3K Obaly pro jedno použití (1) - zpoplatněné",null,null,null,null,null,null,null,null,null,null,null,{"$f":"\"IČO: \"&Úvod!C12","v":"IČO: "},null,null,null,null,0]
["Doplňující výkaz o obalech určených výhradně jinému konečnému uživateli, tzv. průmyslové (2) \n- kompozitní obaly uvedené na trh nebo do oběhu",null,null,null,null,null,null,null,null,null,null,null,{"$f":"Úvod!D4&Úvod!E4","v":"2. čtvrtletí roku 2025"}]
[]
["Vyplňujte v tunách",null,null,null,"PRŮMYSLOVÉ (2)"]
[null,null,null,null,"Neobsahují nápoje (3)",null,"Obsahují nápoje"]
[]
[null,null,null,null,"vyrobené, nakoupené \nv ČR","importované \ndo ČR","vyrobené, nakoupené \nv ČR","importované \ndo ČR"]
[]
[]
["Plasty",null,"PET",null,null,null,null,null,null,null,null,null,null,null,null,null,null,{"$f":"E11*F11*G11*H11*$R$2","v":0}]
[null,null,"PE",null,null,null,null,null,null,null,null,null,null,null,null,null,null,0]
[null,null,"PP",null,null,null,null,null,null,null,null,null,null,null,null,null,null,0]
[null,null,"PS",null,null,null,null,null,null,null,null,null,null,null,null,null,null,0]
[null,null,"PVC",null,null,null,null,null,null,null,null,null,null,null,null,null,null,0]
[null,null,"Jiné",null,null,null,null,null,null,null,null,null,null,null,null,null,null,0]
["Kovy",null,"Al",null,null,null,null,null,null,null,null,null,null,null,null,null,null,0]
[null,null,"Fe",null,null,null,null,null,null,null,null,null,null,null,null,null,null,0]
["Sklo",null,null,null,null,null,null,null,null,null,null,null,null,null,null,null,null,0]
["Papír a vlnitá lepenka",null,null,null,null,null,null,null,null,null,null,null,null,null,null,null,null,0]
["Dřevo",null,null,null,null,null,null,null,null,null,null,null,null,null,null,null,null,0]
["Jiné",null,null,null,null,null,null,null,null,null,null,null,null,null,null,null,null,0]
[]
["1) Obaly, které nevyhovují kritériím § 13 odst. 3 zákona č. 477/2001 Sb., o obalech."]
["2) Obaly, které vyhovují § 2 písm. q) zákona č. 477/2001 Sb., o obalech."]
["3) Obaly, které nevyhovují kritériím uvedeným ve směrnici EU 2019/904 odst. 12."]

{"sheet":"J2","index":12,"n_rows":25,"n_cols":14,"rows_kept":25,"cut":false,"hidden":false,"merged":[[0,0,0,3],[0,8,0,11],[0,4,0,7],[1,10,1,11],[10,2,10,3],[9,2,9,3],[12,2,12,3],[13,2,13,3],[2,10,2,11],[3,0,7,3],[3,4,3,9],[4,4,4,5],[4,6,4,7],[4,8,4,9],[5,4,7,4],[5,5,7,5],[5,6,7,6],[5,7,7,7],[2,0,2,8],[22,0,22,11],[20,0,20,3],[5,10,7,10],[5,11,7,11],[3,10,4,11],[14,0,15,1],[14,2,14,3],[15,2,15,3],[16,0,16,3],[17,0,17,3],[18,0,18,3],[5,8,7,8],[5,9,7,9],[8,0,13,1],[8,2,8,3],[11,2,11,3]]}
["jedno použití",null,null,null,"předplacené",null,null,null,"prodejní, skupinové, přepravní a průmyslové",null,null,null,null,{"$f":"N9*N10*N11*N12*N13*N14*N15*N16*N17*N18*N19*N20*N21","v":0}]
["J2 Obaly a obalové prostředky pro jedno použití (1) - předplacené",null,null,null,null,null,null,null,null,null,{"$f":"\"IČO: \"&Úvod!C12","v":"IČO: "},null,null,0]
["Výkaz o předplacených obalech uvedených na trh nebo do oběhu",null,null,null,null,null,null,null,null,null,{"$f":"Úvod!D4&Úvod!E4","v":"2. čtvrtletí roku 2025"}]
["Vyplňujte v tunách",null,null,null,"OBCHODNÍ (2)",null,null,null,null,null,"PRŮMYSLOVÉ (3)"]
[null,null,null,null,"Prodejní",null,"Skupinové",null,"Přepravní"]
[null,null,null,null,"vyrobené, nakoupené \nv ČR","importované \ndo ČR","vyrobené, nakoupené \nv ČR","importované \ndo ČR","vyrobené, nakoupené \nv ČR","importované \ndo ČR","vyrobené, nakoupené \nv ČR","importované \ndo ČR"]
[]
[]
["Plasty",null,"PET",null,null,null,null,null,null,null,null,null,null,{"$f":"E9*F9*G9*H9*I9*J9*K9*L9*$N$2","v":0}]
[null,null,"PE",null,null,null,null,null,null,null,null,null,null,0]
[null,null,"PP",null,null,null,null,null,null,null,null,null,null,0]
[null,null,"PS",null,null,null,null,null,null,null,null,null,null,0]
[null,null,"PVC",null,null,null,null,null,null,null,null,null,null,0]
[null,null,"Jiné",null,null,null,null,null,null,null,null,null,null,0]
["Kovy",null,"Al",null,null,null,null,null,null,null,null,null,null,0]
[null,null,"Fe",null,null,null,null,null,null,null,null,null,null,0]
["Sklo",null,null,null,null,null,null,null,null,null,null,null,null,0]
["Papír a vlnitá lepenka",null,null,null,null,null,null,null,null,null,null,null,null,0]
["Dřevo",null,null,null,null,null,null,null,null,null,null,null,null,0]
["Textil",null,null,null,null,null,null,null,null,null,null,null,null,0]
["Jiné",null,null,null,null,null,null,null,null,null,null,null,null,0]
[]
["1) Obaly, které nevyhovují kritériím § 13 odst. 3 zákona č. 477/2001 Sb., o obalech, a obaly a obalové prostředky uvedené v části D přílohy č. 4 k zákonu č. 477/2001 Sb., o obalech."]
["2) Obaly, které nevyhovují § 2 písm. q)  zákona č. 477/2001 Sb., o obalech."]
["3) Obaly, které vyhovují § 2 písm. q) zákona č. 477/2001 Sb., o obalech."]

{"sheet":"J3","index":13,"n_rows":25,"n_cols":14,"rows_kept":25,"cut":false,"hidden":false,"merged":[[5,9,7,9],[5,10,7,10],[5,11,7,11],[3,0,7,3],[3,4,3,9],[3,10,4,11],[4,4,4,5],[4,6,4,7],[4,8,4,9],[5,4,7,4],[5,5,7,5],[5,6,7,6],[5,7,7,7],[5,8,7,8],[2,0,2,8],[0,0,0,3],[0,4,0,7],[0,8,0,11],[2,10,2,11],[1,10,1,11],[22,0,22,11],[20,0,20,3],[13,2,13,3],[14,0,15,1],[14,2,14,3],[15,2,15,3],[16,0,16,3],[17,0,17,3],[18,0,18,3],[8,0,13,1],[8,2,8,3],[9,2,9,3],[10,2,10,3],[11,2,11,3],[12,2,12,3]]}
["jedno použití",null,null,null,"neplacené",null,null,null,"prodejní, skupinové, přepravní a průmyslové",null,null,null,null,{"$f":"N9*N10*N11*N12*N13*N14*N15*N16*N17*N18*N19*N20*N21","v":0}]
["J3 Obaly a obalové prostředky pro jedno použití (1) - neplacené",null,null,null,null,null,null,null,null,null,{"$f":"\"IČO: \"&Úvod!C12","v":"IČO: "},null,null,0]
["Výkaz o neplacených obalech uvedených na trh nebo do oběhu",null,null,null,null,null,null,null,null,null,{"$f":"Úvod!D4&Úvod!E4","v":"2. čtvrtletí roku 2025"}]
["Vyplňujte v tunách",null,null,null,"OBCHODNÍ (2)",null,null,null,null,null,"PRŮMYSLOVÉ (3)"]
[null,null,null,null,"Prodejní",null,"Skupinové",null,"Přepravní"]
[null,null,null,null,"vyrobené, nakoupené \nv ČR","importované \ndo ČR","vyrobené, nakoupené \nv ČR","importované \ndo ČR","vyrobené, nakoupené \nv ČR","importované \ndo ČR","vyrobené, nakoupené \nv ČR","importované \ndo ČR"]
[]
[]
["Plasty",null,"PET",null,null,null,null,null,null,null,null,null,null,{"$f":"E9*F9*G9*H9*I9*J9*K9*L9*$N$2","v":0}]
[null,null,"PE",null,null,null,null,null,null,null,null,null,null,0]
[null,null,"PP",null,null,null,null,null,null,null,null,null,null,0]
[null,null,"PS",null,null,null,null,null,null,null,null,null,null,0]
[null,null,"PVC",null,null,null,null,null,null,null,null,null,null,0]
[null,null,"Jiné",null,null,null,null,null,null,null,null,null,null,0]
["Kovy",null,"Al",null,null,null,null,null,null,null,null,null,null,0]
[null,null,"Fe",null,null,null,null,null,null,null,null,null,null,0]
["Sklo",null,null,null,null,null,null,null,null,null,null,null,null,0]
["Papír a vlnitá lepenka",null,null,null,null,null,null,null,null,null,null,null,null,0]
["Dřevo",null,null,null,null,null,null,null,null,null,null,null,null,0]
["Textil",null,null,null,null,null,null,null,null,null,null,null,null,0]
["Jiné",null,null,null,null,null,null,null,null,null,null,null,null,0]
[]
["1) Obaly, které nevyhovují kritériím § 13 odst. 3 zákona č. 477/2001 Sb., o obalech, a obaly a obalové prostředky uvedené v části D přílohy č. 4 k zákonu č. 477/2001 Sb., o obalech."]
["2) Obaly, které nevyhovují § 2 písm. q)  zákona č. 477/2001 Sb., o obalech."]
["3) Obaly, které vyhovují § 2 písm. q) zákona č. 477/2001 Sb., o obalech."]

{"sheet":"J4","index":14,"n_rows":25,"n_cols":14,"rows_kept":25,"cut":false,"hidden":false,"merged":[[5,9,7,9],[5,10,7,10],[5,11,7,11],[3,0,7,3],[3,4,3,9],[3,10,4,11],[4,4,4,5],[4,6,4,7],[4,8,4,9],[5,4,7,4],[5,5,7,5],[5,6,7,6],[5,7,7,7],[5,8,7,8],[2,0,2,8],[0,0,0,3],[0,4,0,7],[0,8,0,11],[2,10,2,11],[1,10,1,11],[22,0,22,11],[20,0,20,3],[13,2,13,3],[14,0,15,1],[14,2,14,3],[15,2,15,3],[16,0,16,3],[17,0,17,3],[18,0,18,3],[8,0,13,1],[8,2,8,3],[9,2,9,3],[10,2,10,3],[11,2,11,3],[12,2,12,3]]}
["jedno použití",null,null,null,"exportované",null,null,null,"prodejní, skupinové, přepravní a průmyslové",null,null,null,null,{"$f":"N9*N10*N11*N12*N13*N14*N15*N16*N17*N18*N19*N20*N21","v":0}]
["J4 Obaly a obalové prostředky pro jedno použití (1) - exportované",null,null,null,null,null,null,null,null,null,{"$f":"\"IČO: \"&Úvod!C12","v":"IČO: "},null,null,0]
["Výkaz o exportovaných obalech uvedených na trh nebo do oběhu",null,null,null,null,null,null,null,null,null,{"$f":"Úvod!D4&Úvod!E4","v":"2. čtvrtletí roku 2025"}]
["Vyplňujte v tunách",null,null,null,"OBCHODNÍ (2)",null,null,null,null,null,"PRŮMYSLOVÉ (3)"]
[null,null,null,null,"Prodejní",null,"Skupinové",null,"Přepravní"]
[null,null,null,null,"vyrobené, nakoupené \nv ČR","importované \ndo ČR","vyrobené, nakoupené \nv ČR","importované \ndo ČR","vyrobené, nakoupené \nv ČR","importované \ndo ČR","vyrobené, nakoupené \nv ČR","importované \ndo ČR"]
[]
[]
["Plasty",null,"PET",null,null,null,null,null,null,null,null,null,null,{"$f":"E9*F9*G9*H9*I9*J9*K9*L9*$N$2","v":0}]
[null,null,"PE",null,null,null,null,null,null,null,null,null,null,0]
[null,null,"PP",null,null,null,null,null,null,null,null,null,null,0]
[null,null,"PS",null,null,null,null,null,null,null,null,null,null,0]
[null,null,"PVC",null,null,null,null,null,null,null,null,null,null,0]
[null,null,"Jiné",null,null,null,null,null,null,null,null,null,null,0]
["Kovy",null,"Al",null,null,null,null,null,null,null,null,null,null,0]
[null,null,"Fe",null,null,null,null,null,null,null,null,null,null,0]
["Sklo",null,null,null,null,null,null,null,null,null,null,null,null,0]
["Papír a vlnitá lepenka",null,null,null,null,null,null,null,null,null,null,null,null,0]
["Dřevo",null,null,null,null,null,null,null,null,null,null,null,null,0]
["Textil",null,null,null,null,null,null,null,null,null,null,null,null,0]
["Jiné",null,null,null,null,null,null,null,null,null,null,null,null,0]
[]
["1) Obaly, které nevyhovují kritériím § 13 odst. 3 zákona č. 477/2001 Sb., o obalech, a obaly a obalové prostředky uvedené v části D přílohy č. 4 k zákonu č. 477/2001 Sb., o obalech."]
["2) Obaly, které nevyhovují § 2 písm. q)  zákona č. 477/2001 Sb., o obalech."]
["3) Obaly, které vyhovují § 2 písm. q) zákona č. 477/2001 Sb., o obalech."]

{"sheet":"L","index":15,"n_rows":22,"n_cols":12,"rows_kept":22,"cut":false,"hidden":false,"merged":[[21,1,21,9],[2,0,2,7],[2,8,2,9],[1,8,1,9],[15,1,15,9],[16,1,16,9],[17,1,17,9],[18,1,18,9],[19,1,19,9],[20,1,20,9],[5,0,5,3],[6,0,6,3],[7,0,8,2],[9,0,10,2],[11,0,12,2],[14,1,14,9],[11,4,12,4],[1,0,1,3],[3,0,4,3],[3,4,3,6],[0,5,0,9],[0,1,0,4]]}
[null,"jedno použití",null,null,null,"obsahují/neobsahují nápoje",null,null,null,null,null,{"$f":"L6*L7*L8*L9*L10*L11*L12*L13","v":0}]
["L - Litteringové obaly a obalové prostředky (1)",null,null,null,null,null,null,null,{"$f":"\"IČO: \"&Úvod!C12","v":"IČO: "},null,null,0]
["Výkaz pro evidenci jednorázových plastových obalů a obalových prostředků, na které se vztahují povinnosti úhrady nákladů na úklid odpadu z obalů dle § 10a zákona č. 477/2001 Sb., o obalech.  ",null,null,null,null,null,null,null,{"$f":"Úvod!D4&Úvod!E4","v":"2. čtvrtletí roku 2025"}]
[null,null,null,null,"Zpoplatněné",null,null,"Předplacené","Neplacené","Exportované"]
[null,null,null,null,"hmotnost plastu \nv tunách","celková hmotnost \nv tunách","množství \nv kusech","celková hmotnost \nv tunách","celková hmotnost \nv tunách","celková hmotnost \nv tunách"]
["Nádoby na nápoje (2)",null,null,null,null,null,null,null,null,null,null,{"$f":"F6*H6*I6*J6*$L$2","v":0}]
["Sáčky a balení na potraviny (3)",null,null,null,null,null,null,null,null,null,null,{"$f":"F7*H7*I7*J7*$L$2","v":0}]
["Nápojové kelímky",null,null,"vyrobené z plastu (4)",null,null,null,null,null,null,null,{"$f":"F8*H8*I8*J8*$L$2","v":0}]
[null,null,null,"vyrobené částečně z plastu (5)",null,null,null,null,null,null,null,{"$f":"E9*F9*H9*I9*J9*$L$2","v":0}]
["Nádoby na potraviny ",null,null,"vyrobené z plastu (6)",null,null,null,null,null,null,null,{"$f":"F10*H10*I10*J10*$L$2","v":0}]
[null,null,null,"vyrobené částečně z plastu (7)",null,null,null,null,null,null,null,{"$f":"E11*F11*H11*I11*J11*$L$2","v":0}]
["Plastové odnosné \ntašky (8)",null,null,"Lehké plastové tašky \n15 < 50 mikronů ",null,null,null,null,null,null,null,{"$f":"F12*G12*H12*I12*J12*$L$2","v":0}]
[null,null,null,"Lehké plastové tašky \n< 15 mikronů",null,null,null,null,null,null,null,{"$f":"F13*G13*H13*I13*J13*$L$2","v":0}]
[]
["1)","Obaly a obalové prostředky uvedené v části C a D přílohy č. 4 k zákonu 477/2001 Sb., o obalech."]
["2)","Nádoby na nápoje o objemu až 3 litry, tj. nádoby, jež se používají k pojmutí kapalin, např. nápojové lahve včetně jejich uzávěrů a víček a nápojové obaly z kompozitních materiálů, včetně jejich uzávěrů a víček, s výjimkou skleněných nebo kovových nádob na nápoje, které mají uzávěry a víčka vyrobené z plastu, včetně jejich uzávěrů a víček, uvedené v části C přílohy č. 4 k zákonu \nč. 477/2001 Sb., o obalech."]
["3)","Sáčky a balení zhotovené z pružného materiálu, které obsahují potraviny určené k okamžité spotřebě z těchto sáčků nebo balení bez jakékoli další přípravy, uvedené v části C přílohy č. 4 k zákonu č. 477/2001 Sb., o obalech."]
["4)","Nápojové kelímky vyrobené z plastu, včetně jejich uzávěrů a víček, uvedené v části D přílohy č. 4 k zákonu č. 477/2001 Sb., o obalech."]
["5)","Nápojové kelímky vyrobené částečně z plastu, včetně jejich uzávěrů a víček, uvedené v části D přílohy č. 4 k zákonu č. 477/2001 Sb., o obalech."]
["6)","Nádoby na potraviny vyrobené z plastu, tj. nádoby, jako jsou krabičky s víkem či bez něj, jež se používají k pojmutí potravin, které jsou:\na) určeny k okamžité spotřebě, a to buď na místě, nebo k odnesení s sebou,\nb) obvykle spotřebovávány z této nádoby a\nc)  připraveny ke spotřebě bez jakékoli další přípravy, jako je vaření nebo ohřívání, včetně nádob na potraviny používaných pro rychlé občerstvení nebo jiná jídla připravená k okamžité spotřebě,     s výjimkou nádob na nápoje, talířů a sáčků a balení obsahujících potraviny,\nuvedené v části D přílohy č. 4 k zákonu č. 477/2001 Sb., o obalech."]
["7)","Nádoby na potraviny vyrobené částečně z plastu, tj. nádoby, jako jsou krabičky s víkem či bez něj, jež se používají k pojmutí potravin, které jsou:\na) určeny k okamžité spotřebě, a to buď na místě, nebo k odnesení s sebou,\nb) obvykle spotřebovávány z této nádoby a\nc) připraveny ke spotřebě bez jakékoli další přípravy, jako je vaření nebo ohřívání, včetně nádob na potraviny používaných pro rychlé občerstvení nebo jiná jídla připravená k okamžité spotřebě,        s výjimkou nádob na nápoje, talířů a sáčků a balení obsahujících potraviny,\nuvedené v části D přílohy č. 4 k zákonu č. 477/2001 Sb., o obalech."]
["8)","Plastové odnosné tašky poskytované spotřebiteli v místě prodeje zboží či produktů, uvedené v části C přílohy č. 4 k zákonu č. 477/2001 Sb., o obalech."]

{"sheet":"O1-1A","index":16,"n_rows":63,"n_cols":18,"rows_kept":63,"cut":false,"hidden":false,"merged":[[1,13,1,15],[0,0,0,3],[0,8,0,11],[0,4,0,7],[0,12,0,15],[1,0,1,12],[2,0,2,12],[2,13,2,15],[3,0,8,3],[3,4,3,15],[4,4,4,7],[4,8,4,11],[4,12,4,15],[5,4,5,5],[5,6,5,7],[5,8,5,9],[5,10,5,11],[5,12,5,13],[5,14,5,15],[6,4,8,4],[6,5,8,5],[6,6,8,6],[6,7,8,7],[6,8,8,8],[6,12,8,12],[6,13,8,13],[6,14,8,14],[6,15,8,15],[9,0,29,0],[9,1,11,1],[9,2,9,3],[10,2,10,3],[11,2,11,3],[16,1,17,1],[16,2,16,3],[17,2,17,3],[18,1,19,1],[18,2,18,3],[19,2,19,3],[12,1,13,1],[12,2,12,3],[13,2,13,3],[14,1,15,1],[14,2,14,3],[15,2,15,3],[20,1,21,1],[20,2,20,3],[21,2,21,3],[6,9,8,9],[6,10,8,10],[6,11,8,11],[28,1,29,1],[29,2,29,3],[30,0,33,0],[30,1,30,3],[31,1,31,3],[32,1,32,3],[33,1,33,3],[24,1,25,1],[24,2,24,3],[25,2,25,3],[26,1,27,1],[26,2,26,3],[27,2,27,3],[34,0,34,3],[36,0,38,3],[36,4,36,7],[36,8,36,11],[37,4,38,5],[37,6,38,7],[37,8,38,9],[22,1,23,1],[22,2,22,3],[23,2,23,3],[40,8,40,9],[40,10,40,11],[41,1,41,3],[41,4,41,5],[41,6,41,7],[41,8,41,9],[41,10,41,11],[37,10,38,11],[39,0,41,0],[39,1,39,3],[39,4,39,5],[39,6,39,7],[39,8,39,9],[39,10,39,11],[40,1,40,3],[40,4,40,5],[40,6,40,7],[43,10,43,11],[44,1,44,3],[44,4,44,5],[44,6,44,7],[44,8,44,9],[44,10,44,11],[42,0,46,0],[42,1,42,3],[42,4,42,5],[42,6,42,7],[42,8,42,9],[42,10,42,11],[43,1,43,3],[43,4,43,5],[43,6,43,7],[43,8,43,9],[45,1,45,3],[45,4,45,5],[45,6,45,7],[45,8,45,9],[45,10,45,11],[46,1,46,3],[46,4,46,5],[46,6,46,7],[46,8,46,9],[46,10,46,11],[50,0,50,3],[50,4,50,5],[50,6,50,7],[50,8,50,9],[50,10,50,11],[48,10,48,11],[49,0,49,3],[49,4,49,5],[49,6,49,7],[49,8,49,9],[49,10,49,11],[47,0,48,0],[47,1,47,3],[47,4,47,5],[47,6,47,7],[47,8,47,9],[47,10,47,11],[48,1,48,3],[48,4,48,5],[48,6,48,7],[48,8,48,9]]}
["opakované použití",null,null,null,"zpoplatněné",null,null,null,"neobsahují nápoje",null,null,null,"prodejní",null,null,null,null,{"$f":"R10*R11*R12*R13*R14*R15*R16*R17*R18*R19*R20*R21*R22*R23*R24*R25*R26*R27*R28*R29*R30*R31*R32*R33*R34*R35*R40*R41*R42*R43*R44*R45*R46*R47*R48*R49*R50*R51","v":0}]
["O1-1A Obaly pro opakované použití (1) - zpoplatněné",null,null,null,null,null,null,null,null,null,null,null,null,{"$f":"\"IČO: \"&Úvod!C12","v":"IČO: "},null,null,null,0]
["Výkaz o obalech, které neobsahují nápoje (2) - prodejní obaly uvedené na trh nebo do oběhu",null,null,null,null,null,null,null,null,null,null,null,null,{"$f":"Úvod!D4&Úvod!E4","v":"2. čtvrtletí roku 2025"}]
["Vyplňujte v tunách",null,null,null,"OBCHODNÍ (3) - Prodejní"]
[null,null,null,null,"Měkké, flexibilní",null,null,null,"Pevné, pevné duté do 3 L ",null,null,null,"Pevné duté nad 3 L "]
[null,null,null,null,"primární (4)",null,"recyklát (5)",null,"primární (4)",null,"recyklát (5)",null,"primární (4)",null,"recyklát (5)"]
[null,null,null,null,"vyrobené, nakoupené \nv ČR","importované \ndo ČR","vyrobené, nakoupené \nv ČR","importované \ndo ČR","vyrobené, nakoupené \nv ČR","importované \ndo ČR","vyrobené, nakoupené \nv ČR","importované \ndo ČR","vyrobené, nakoupené \nv ČR","importované \ndo ČR","vyrobené, nakoupené \nv ČR","importované \ndo ČR"]
[]
[]
["Plasty","PET","transparentní (6)",null,null,null,null,null,null,null,null,null,null,null,null,null,null,{"$f":"E10*F10*G10*H10*I10*J10*K10*L10*M10*N10*O10*P10*$R$2","v":0}]
[null,null,"průhledné barevné (8)",null,null,null,null,null,null,null,null,null,null,null,null,null,null,0]
[null,null,"neprůhledné barevné (9)",null,null,null,null,null,null,null,null,null,null,null,null,null,null,0]
[null,"PE","transparentní (6)",null,null,null,null,null,null,null,null,null,null,null,null,null,null,0]
[null,null,"barevné (7)",null,null,null,null,null,null,null,null,null,null,null,null,null,null,0]
[null,"PP","transparentní (6)",null,null,null,null,null,null,null,null,null,null,null,null,null,null,0]
[null,null,"barevné (7)",null,null,null,null,null,null,null,null,null,null,null,null,null,null,0]
[null,"PS","transparentní (6)",null,null,null,null,null,null,null,null,null,null,null,null,null,null,0]
[null,null,"barevné (7)",null,null,null,null,null,null,null,null,null,null,null,null,null,null,0]
[null,"XPS","transparentní (6)",null,null,null,null,null,null,null,null,null,null,null,null,null,null,0]
[null,null,"barevné (7)",null,null,null,null,null,null,null,null,null,null,null,null,null,null,0]
[null,"EPS","transparentní (6)",null,null,null,null,null,null,null,null,null,null,null,null,null,null,0]
[null,null,"barevné (7)",null,null,null,null,null,null,null,null,null,null,null,null,null,null,0]
[null,"PVC","transparentní (6)",null,null,null,null,null,null,null,null,null,null,null,null,null,null,0]
[null,null,"barevné (7)",null,null,null,null,null,null,null,null,null,null,null,null,null,null,0]
[null,"Jiné","transparentní (6)",null,null,null,null,null,null,null,null,null,null,null,null,null,null,0]
[null,null,"barevné (7)",null,null,null,null,null,null,null,null,null,null,null,null,null,null,0]
[null,"Biologicky rozložitelné (11)","transparentní (6)",null,null,null,null,null,null,null,null,null,null,null,null,null,null,0]
[null,null,"barevné (7)",null,null,null,null,null,null,null,null,null,null,null,null,null,null,0]
[null,"Kompozitní \n(10)","transparentní (6)",null,null,null,null,null,null,null,null,null,null,null,null,null,null,0]
[null,null,"barevné (7)",null,null,null,null,null,null,null,null,null,null,null,null,null,null,0]
["Kovy","Al",null,null,null,null,null,null,null,null,null,null,null,null,null,null,null,0]
[null,"Fe","FE",null,null,null,null,null,null,null,null,null,null,null,null,null,null,0]
[null,"Kompozitní Al (10)",null,null,null,null,null,null,null,null,null,null,null,null,null,null,null,0]
[null,"Kompozitní Fe (10)",null,null,null,null,null,null,null,null,null,null,null,null,null,null,null,0]
["Kompozitní materiál (10)",null,null,null,null,null,null,null,null,null,null,null,null,null,null,null,null,0]
[]
["Vyplňujte v tunách",null,null,null,"primární (4)",null,null,null,"recyklát (5)"]
[null,null,null,null,"vyrobené, nakoupené v ČR",null,"importované \ndo ČR",null,"vyrobené, nakoupené v ČR",null,"importované \ndo ČR"]
[]
["Sklo","Transparentní (6)",null,null,null,null,null,null,null,null,null,null,null,null,null,null,null,{"$f":"E40*G40*I40*K40*$R$2","v":0}]
[null,"Barevné (7)",null,null,null,null,null,null,null,null,null,null,null,null,null,null,null,0]
[null,"Kompozitní (10)",null,null,null,null,null,null,null,null,null,null,null,null,null,null,null,0]
["Papír","Papír",null,null,null,null,null,null,null,null,null,null,null,null,null,null,null,0]
[null,"Hladká lepenka",null,null,null,null,null,null,null,null,null,null,null,null,null,null,null,0]
[null,"Vlnitá lepenka",null,null,null,null,null,null,null,null,null,null,null,null,null,null,null,0]
[null,"Nasávaná kartonáž",null,null,null,null,null,null,null,null,null,null,null,null,null,null,null,0]
[null,"Kompozitní (10)",null,null,null,null,null,null,null,null,null,null,null,null,null,null,null,0]
["Dřevo","Dřevo a dřevotříska",null,null,null,null,null,null,null,null,null,null,null,null,null,null,null,0]
[null,"Kompozit s nedřevěnými částmi (10)",null,null,null,null,null,null,null,null,null,null,null,null,null,null,null,0]
["Textil",null,null,null,null,null,null,null,null,null,null,null,null,null,null,null,null,0]
["Jiné",null,null,null,null,null,null,null,null,null,null,null,null,null,null,null,null,0]
[]
["1) Obaly, které vyhovují kritériím § 13 odst. 3 zákona č. 477/2001 Sb., o obalech."]
["2) Obaly, které nevyhovují kritériím uvedeným ve směrnici EU 2019/904 odst. 12."]
["3) Obaly, které nevyhovují § 2 písm. q)  zákona č. 477/2001 Sb., o obalech."]
["4) Množství primární suroviny v obalu."]
["5) Prokazatelné množství recyklovaného materiálu v obalu."]
["6) Obaly, čiré bez viditelného zabarvení."]
["7) Obaly, průhledné se zabarvením či zcela probarvené."]
["8) Obaly z PET, průhledné se zabarvením."]
["9) Obaly z PET, zcela probarvené."]
["10) Pokračujte ve vyplňovaní na listu O1-1K."]
["11) Biologickým rozkladem je aerobní nebo anaerobní rozklad odpadů z obalů; oxo-rozložitelný plastový obal se nepovažuje za obal rozložitelný biologickým rozkladem."]

{"sheet":"O1-1B","index":17,"n_rows":60,"n_cols":22,"rows_kept":60,"cut":false,"hidden":false,"merged":[[1,0,1,15],[2,0,2,15],[2,16,2,19],[1,16,1,19],[48,14,48,15],[48,16,48,17],[48,18,48,19],[49,4,49,5],[49,6,49,7],[49,8,49,9],[49,10,49,11],[49,12,49,13],[49,14,49,15],[49,16,49,17],[49,18,49,19],[48,4,48,5],[48,6,48,7],[48,8,48,9],[48,10,48,11],[48,12,48,13],[46,14,46,15],[46,16,46,17],[46,18,46,19],[47,4,47,5],[47,6,47,7],[47,8,47,9],[47,10,47,11],[47,12,47,13],[47,14,47,15],[47,16,47,17],[47,18,47,19],[46,4,46,5],[46,6,46,7],[46,8,46,9],[46,10,46,11],[46,12,46,13],[44,14,44,15],[44,16,44,17],[44,18,44,19],[45,4,45,5],[45,6,45,7],[45,8,45,9],[45,10,45,11],[45,12,45,13],[45,14,45,15],[45,16,45,17],[45,18,45,19],[44,4,44,5],[44,6,44,7],[44,8,44,9],[44,10,44,11],[44,12,44,13],[42,14,42,15],[42,16,42,17],[42,18,42,19],[43,4,43,5],[43,6,43,7],[43,8,43,9],[43,10,43,11],[43,12,43,13],[43,14,43,15],[43,16,43,17],[43,18,43,19],[42,4,42,5],[42,6,42,7],[42,8,42,9],[42,10,42,11],[42,12,42,13],[38,14,40,15],[38,16,40,17],[38,18,40,19],[41,4,41,5],[41,6,41,7],[41,8,41,9],[41,10,41,11],[41,12,41,13],[41,14,41,15],[41,16,41,17],[41,18,41,19],[38,4,40,5],[38,6,40,7],[38,8,40,9],[38,10,40,11],[38,12,40,13],[36,4,36,11],[36,12,36,19],[37,4,37,7],[37,8,37,11],[37,12,37,15],[37,16,37,19],[0,0,0,4],[0,10,0,14],[0,5,0,9],[0,15,0,19],[6,16,6,17],[6,18,6,19],[3,0,9,3],[3,4,3,19],[4,4,4,11],[4,12,4,19],[5,4,5,7],[5,8,5,11],[5,12,5,15],[5,16,5,19],[6,4,6,5],[6,6,6,7],[7,9,9,9],[6,8,6,9],[6,10,6,11],[6,12,6,13],[6,14,6,15],[7,4,9,4],[7,5,9,5],[7,6,9,6],[7,7,9,7],[7,8,9,8],[7,16,9,16],[7,17,9,17],[7,18,9,18],[7,19,9,19],[10,0,29,0],[10,1,11,1],[10,2,10,3],[11,2,11,3],[12,1,13,1],[12,2,12,3],[7,10,9,10],[7,11,9,11],[7,12,9,12],[7,13,9,13],[7,14,9,14],[7,15,9,15],[13,2,13,3],[14,1,15,1],[14,2,14,3],[15,2,15,3],[16,1,17,1],[16,2,16,3],[17,2,17,3],[18,1,19,1],[18,2,18,3],[19,2,19,3],[20,1,21,1],[20,2,20,3],[21,2,21,3],[22,1,23,1],[22,2,22,3],[23,2,23,3],[24,1,25,1],[24,2,24,3],[25,2,25,3],[30,0,33,0],[30,1,30,3],[31,1,31,3],[32,1,32,3],[33,1,33,3],[26,1,27,1],[26,2,26,3],[27,2,27,3],[28,1,29,1],[29,2,29,3],[34,0,34,3],[36,0,40,3],[48,0,48,3],[49,0,49,3],[41,0,45,0],[41,1,41,3],[43,1,43,3],[44,1,44,3],[45,1,45,3],[46,0,47,0],[46,1,46,3],[47,1,47,3]]}
["opakované použití",null,null,null,null,"zpoplatněné",null,null,null,null,"neobsahují nápoje",null,null,null,null,"skupinové a přepravní",null,null,null,null,null,{"$f":"V11*V12*V13*V14*V15*V16*V17*V18*V19*V20*V21*V22*V23*V24*V25*V26*V27*V28*V29*V30*V31*V32*V33*V34*V35*V42*V43*V44*V45*V46*V47*V48*V49*V50","v":0}]
["O1-1B Obaly pro opakované použití (1) - zpoplatněné",null,null,null,null,null,null,null,null,null,null,null,null,null,null,null,{"$f":"\"IČO: \"&Úvod!C12","v":"IČO: "},null,null,null,null,0]
["Výkaz o obalech, které neobsahují nápoje (2) - skupinové a přepravní obaly uvedené na trh nebo do oběhu",null,null,null,null,null,null,null,null,null,null,null,null,null,null,null,{"$f":"Úvod!D4&Úvod!E4","v":"2. čtvrtletí roku 2025"}]
["Vyplňujte v tunách",null,null,null,"OBCHODNÍ (3)"]
[null,null,null,null,"Skupinové",null,null,null,null,null,null,null,"Přepravní"]
[null,null,null,null,"Měkké, flexibilní",null,null,null,"Pevné, pevné duté",null,null,null,"Měkké, flexibilní",null,null,null,"Pevné, pevné duté"]
[null,null,null,null,"primární (4)",null,"recyklát (5)",null,"primární (4)",null,"recyklát (5)",null,"primární (4)",null,"recyklát (5)",null,"primární (4)",null,"recyklát (5)"]
[null,null,null,null,"vyrobené, nakoupené \nv ČR","importované \ndo ČR","vyrobené, nakoupené \nv ČR","importované \ndo ČR","vyrobené, nakoupené \nv ČR","importované \ndo ČR","vyrobené, nakoupené \nv ČR","importované \ndo ČR","vyrobené, nakoupené \nv ČR","importované \ndo ČR","vyrobené, nakoupené \nv ČR","importované \ndo ČR","vyrobené, nakoupené \nv ČR","importované \ndo ČR","vyrobené, nakoupené \nv ČR","importované \ndo ČR"]
[]
[]
["Plasty","PET","transparentní (6)",null,null,null,null,null,null,null,null,null,null,null,null,null,null,null,null,null,null,{"$f":"E11*F11*G11*H11*I11*J11*K11*L11*M11*N11*O11*P11*Q11*R11*S11*T11*$V$2","v":0}]
[null,null,"barevné (7)",null,null,null,null,null,null,null,null,null,null,null,null,null,null,null,null,null,null,0]
[null,"PE","transparentní (6)",null,null,null,null,null,null,null,null,null,null,null,null,null,null,null,null,null,null,0]
[null,null,"barevné (7)",null,null,null,null,null,null,null,null,null,null,null,null,null,null,null,null,null,null,0]
[null,"PP","transparentní (6)",null,null,null,null,null,null,null,null,null,null,null,null,null,null,null,null,null,null,0]
[null,null,"barevné (7)",null,null,null,null,null,null,null,null,null,null,null,null,null,null,null,null,null,null,0]
[null,"PS","transparentní (6)",null,null,null,null,null,null,null,null,null,null,null,null,null,null,null,null,null,null,0]
[null,null,"barevné (7)",null,null,null,null,null,null,null,null,null,null,null,null,null,null,null,null,null,null,0]
[null,"XPS","transparentní (6)",null,null,null,null,null,null,null,null,null,null,null,null,null,null,null,null,null,null,0]
[null,null,"barevné (7)",null,null,null,null,null,null,null,null,null,null,null,null,null,null,null,null,null,null,0]
[null,"EPS","transparentní (6)",null,null,null,null,null,null,null,null,null,null,null,null,null,null,null,null,null,null,0]
[null,null,"barevné (7)",null,null,null,null,null,null,null,null,null,null,null,null,null,null,null,null,null,null,0]
[null,"PVC","transparentní (6)",null,null,null,null,null,null,null,null,null,null,null,null,null,null,null,null,null,null,0]
[null,null,"barevné (7)",null,null,null,null,null,null,null,null,null,null,null,null,null,null,null,null,null,null,0]
[null,"Jiné","transparentní (6)",null,null,null,null,null,null,null,null,null,null,null,null,null,null,null,null,null,null,0]
[null,null,"barevné (7)",null,null,null,null,null,null,null,null,null,null,null,null,null,null,null,null,null,null,0]
[null,"Biologicky rozložitelné (8)","transparentní (6)",null,null,null,null,null,null,null,null,null,null,null,null,null,null,null,null,null,null,0]
[null,null,"barevné (7)",null,null,null,null,null,null,null,null,null,null,null,null,null,null,null,null,null,null,0]
[null,"Kompozitní \n(9)","transparentní (6)",null,null,null,null,null,null,null,null,null,null,null,null,null,null,null,null,null,null,0]
[null,null,"barevné (7)",null,null,null,null,null,null,null,null,null,null,null,null,null,null,null,null,null,null,0]
["Kovy","Al",null,null,null,null,null,null,null,null,null,null,null,null,null,null,null,null,null,null,null,0]
[null,"Fe","FE",null,null,null,null,null,null,null,null,null,null,null,null,null,null,null,null,null,null,0]
[null,"Kompozitní Al (9)",null,null,null,null,null,null,null,null,null,null,null,null,null,null,null,null,null,null,null,0]
[null,"Kompozitní Fe (9)",null,null,null,null,null,null,null,null,null,null,null,null,null,null,null,null,null,null,null,0]
["Kompozitní materiál (9)",null,null,null,null,null,null,null,null,null,null,null,null,null,null,null,null,null,null,null,null,0]
[]
["Vyplňujte v tunách",null,null,null,"Skupinové",null,null,null,null,null,null,null,"Přepravní"]
[null,null,null,null,"primární (4)",null,null,null,"recyklát (5)",null,null,null,"primární (4)",null,null,null,"recyklát (5)"]
[null,null,null,null,"vyrobené, nakoupené \nv ČR",null,"importované \ndo ČR",null,"vyrobené, nakoupené \nv ČR",null,"importované \ndo ČR",null,"vyrobené, nakoupené \nv ČR",null,"importované \ndo ČR",null,"vyrobené, nakoupené \nv ČR",null,"importované \ndo ČR"]
[]
[]
["Papír","Papír",null,null,null,null,null,null,null,null,null,null,null,null,null,null,null,null,null,null,null,{"$f":"E42*G42*I42*K42*M42*O42*Q42*S42*$V$2","v":0}]
[null,"Hladká lepenka",null,null,null,null,null,null,null,null,null,null,null,null,null,null,null,null,null,null,null,0]
[null,"Vlnitá lepenka",null,null,null,null,null,null,null,null,null,null,null,null,null,null,null,null,null,null,null,0]
[null,"Nasávaná kartonáž",null,null,null,null,null,null,null,null,null,null,null,null,null,null,null,null,null,null,null,0]
[null,"Kompozitní (9)",null,null,null,null,null,null,null,null,null,null,null,null,null,null,null,null,null,null,null,0]
["Dřevo","Dřevo a dřevotříska",null,null,null,null,null,null,null,null,null,null,null,null,null,null,null,null,null,null,null,0]
[null,"Kompozit s nedřevěnými \nčástmi (9)",null,null,null,null,null,null,null,null,null,null,null,null,null,null,null,null,null,null,null,0]
["Textil",null,null,null,null,null,null,null,null,null,null,null,null,null,null,null,null,null,null,null,null,0]
["Jiné",null,null,null,null,null,null,null,null,null,null,null,null,null,null,null,null,null,null,null,null,0]
[]
["1) Obaly, které vyhovují kritériím § 13 odst. 3 zákona č. 477/2001 Sb., o obalech."]
["2) Obaly, které nevyhovují kritériím uvedeným ve směrnici EU 2019/904 odst. 12."]
["3) Obaly, které nevyhovují § 2 písm. q)  zákona č. 477/2001 Sb., o obalech."]
["4) Množství primární suroviny v obalu."]
["5) Prokazatelné množství recyklovaného materiálu v obalu."]
["6) Obaly, čiré bez viditelného zabarvení."]
["7) Obaly, průhledné se zabarvením či zcela probarvené."]
["8) Biologickým rozkladem je aerobní nebo anaerobní rozklad odpadů z obalů; oxo-rozložitelný plastový obal se nepovažuje za obal rozložitelný biologickým rozkladem."]
["9) Pokračujte ve vyplňovaní na listu O1-1K."]

{"sheet":"O1-1K","index":18,"n_rows":25,"n_cols":16,"rows_kept":25,"cut":false,"hidden":false,"merged":[[1,0,1,8],[0,4,0,5],[0,6,0,7],[0,8,0,10],[0,11,0,13],[1,10,1,13],[0,0,0,3],[2,10,2,13],[4,0,8,3],[4,4,4,9],[5,4,5,5],[5,6,5,7],[5,8,5,9],[6,4,8,4],[6,5,8,5],[6,6,8,6],[6,7,8,7],[6,8,8,8],[6,9,8,9],[2,0,3,9],[9,0,14,1],[9,2,9,3],[10,2,10,3],[11,2,11,3],[12,2,12,3],[13,2,13,3],[14,2,14,3],[20,0,20,3],[15,0,16,1],[15,2,15,3],[16,2,16,3],[17,0,17,3],[18,0,18,3],[19,0,19,3]]}
["opakované použití",null,null,null,"zpoplatněné",null,"neobsahují nápoje",null,"prodejní, skupinové a přepravní",null,null,"kompozitní",null,null,null,{"$f":"P10*P11*P12*P13*P14*P15*P16*P17*P18*P19*P20*P21","v":0}]
["O1-1K Obaly pro opakované použití (1) - zpoplatněné",null,null,null,null,null,null,null,null,null,{"$f":"\"IČO: \"&Úvod!C12","v":"IČO: "},null,null,null,null,0]
["Doplňující výkaz o obalech, které neobsahují nápoje (2) - prodejní, skupinové a přepravní \n- kompozitní obaly uvedené na trh nebo do oběhu",null,null,null,null,null,null,null,null,null,{"$f":"Úvod!D4&Úvod!E4","v":"2. čtvrtletí roku 2025"}]
[]
["Vyplňujte v tunách",null,null,null,"OBCHODNÍ (3)"]
[null,null,null,null,"Prodejní",null,"Skupinové",null,"Přepravní"]
[null,null,null,null,"vyrobené, nakoupené \nv ČR","importované \ndo ČR","vyrobené, nakoupené \nv ČR","importované \ndo ČR","vyrobené, nakoupené \nv ČR","importované \ndo ČR"]
[]
[]
["Plasty",null,"PET",null,null,null,null,null,null,null,null,null,null,null,null,{"$f":"E10*F10*G10*H10*I10*J10*$P$2","v":0}]
[null,null,"PE",null,null,null,null,null,null,null,null,null,null,null,null,0]
[null,null,"PP",null,null,null,null,null,null,null,null,null,null,null,null,0]
[null,null,"PS",null,null,null,null,null,null,null,null,null,null,null,null,0]
[null,null,"PVC",null,null,null,null,null,null,null,null,null,null,null,null,0]
[null,null,"Jiné",null,null,null,null,null,null,null,null,null,null,null,null,0]
["Kovy",null,"Al",null,null,null,null,null,null,null,null,null,null,null,null,0]
[null,null,"Fe",null,null,null,null,null,null,null,null,null,null,null,null,0]
["Sklo",null,null,null,null,null,null,null,null,null,null,null,null,null,null,0]
["Papír a vlnitá lepenka",null,null,null,null,null,null,null,null,null,null,null,null,null,null,0]
["Dřevo",null,null,null,null,null,null,null,null,null,null,null,null,null,null,0]
["Jiné",null,null,null,null,null,null,null,null,null,null,null,null,null,null,0]
[]
["1) Obaly, které vyhovují kritériím § 13 odst. 3 zákona č. 477/2001 Sb., o obalech."]
["2) Obaly, které nevyhovují kritériím uvedeným ve směrnici EU 2019/904 odst. 12."]
["3) Obaly, které nevyhovují § 2 písm. q)  zákona č. 477/2001 Sb., o obalech."]

{"sheet":"O1-2A","index":19,"n_rows":63,"n_cols":18,"rows_kept":63,"cut":false,"hidden":false,"merged":[[1,13,1,15],[0,0,0,3],[0,8,0,11],[0,4,0,7],[0,12,0,15],[1,0,1,12],[2,0,2,12],[2,13,2,15],[3,0,8,3],[3,4,3,15],[4,4,4,7],[4,8,4,11],[4,12,4,15],[5,4,5,5],[5,6,5,7],[5,8,5,9],[5,10,5,11],[5,12,5,13],[5,14,5,15],[6,4,8,4],[6,5,8,5],[6,6,8,6],[6,7,8,7],[6,8,8,8],[6,12,8,12],[6,13,8,13],[6,14,8,14],[6,15,8,15],[9,0,29,0],[9,1,11,1],[9,2,9,3],[10,2,10,3],[11,2,11,3],[16,1,17,1],[16,2,16,3],[17,2,17,3],[18,1,19,1],[18,2,18,3],[19,2,19,3],[12,1,13,1],[12,2,12,3],[13,2,13,3],[14,1,15,1],[14,2,14,3],[15,2,15,3],[20,1,21,1],[20,2,20,3],[21,2,21,3],[6,9,8,9],[6,10,8,10],[6,11,8,11],[28,1,29,1],[29,2,29,3],[30,0,33,0],[30,1,30,3],[31,1,31,3],[32,1,32,3],[33,1,33,3],[24,1,25,1],[24,2,24,3],[25,2,25,3],[26,1,27,1],[26,2,26,3],[27,2,27,3],[34,0,34,3],[36,0,38,3],[36,4,36,7],[36,8,36,11],[37,4,38,5],[37,6,38,7],[37,8,38,9],[22,1,23,1],[22,2,22,3],[23,2,23,3],[40,8,40,9],[40,10,40,11],[41,1,41,3],[41,4,41,5],[41,6,41,7],[41,8,41,9],[41,10,41,11],[37,10,38,11],[39,0,41,0],[39,1,39,3],[39,4,39,5],[39,6,39,7],[39,8,39,9],[39,10,39,11],[40,1,40,3],[40,4,40,5],[40,6,40,7],[43,10,43,11],[44,1,44,3],[44,4,44,5],[44,6,44,7],[44,8,44,9],[44,10,44,11],[42,0,46,0],[42,1,42,3],[42,4,42,5],[42,6,42,7],[42,8,42,9],[42,10,42,11],[43,1,43,3],[43,4,43,5],[43,6,43,7],[43,8,43,9],[45,1,45,3],[45,4,45,5],[45,6,45,7],[45,8,45,9],[45,10,45,11],[46,1,46,3],[46,4,46,5],[46,6,46,7],[46,8,46,9],[46,10,46,11],[50,0,50,3],[50,4,50,5],[50,6,50,7],[50,8,50,9],[50,10,50,11],[48,10,48,11],[49,0,49,3],[49,4,49,5],[49,6,49,7],[49,8,49,9],[49,10,49,11],[47,0,48,0],[47,1,47,3],[47,4,47,5],[47,6,47,7],[47,8,47,9],[47,10,47,11],[48,1,48,3],[48,4,48,5],[48,6,48,7],[48,8,48,9]]}
["opakované použití",null,null,null,"zpoplatněné",null,null,null,"obsahují nápoje",null,null,null,"prodejní",null,null,null,null,{"$f":"R10*R11*R12*R13*R14*R15*R16*R17*R18*R19*R20*R21*R22*R23*R24*R25*R26*R27*R28*R29*R30*R31*R32*R33*R34*R35*R40*R41*R42*R43*R44*R45*R46*R47*R48*R49*R50*R51","v":0}]
["O1-2A Obaly pro opakované použití (1) - zpoplatněné",null,null,null,null,null,null,null,null,null,null,null,null,{"$f":"\"IČO: \"&Úvod!C12","v":"IČO: "},null,null,null,0]
["Výkaz o obalech, které obsahují nápoje (2) - prodejní obaly uvedené na trh nebo do oběhu",null,null,null,null,null,null,null,null,null,null,null,null,{"$f":"Úvod!D4&Úvod!E4","v":"2. čtvrtletí roku 2025"}]
["Vyplňujte v tunách",null,null,null,"OBCHODNÍ (3) - Prodejní"]
[null,null,null,null,"Měkké, flexibilní",null,null,null,"Pevné, pevné duté do 3 L ",null,null,null,"Pevné duté nad 3 L "]
[null,null,null,null,"primární (4)",null,"recyklát (5)",null,"primární (4)",null,"recyklát (5)",null,"primární (4)",null,"recyklát (5)"]
[null,null,null,null,"vyrobené, nakoupené \nv ČR","importované \ndo ČR","vyrobené, nakoupené \nv ČR","importované \ndo ČR","vyrobené, nakoupené \nv ČR","importované \ndo ČR","vyrobené, nakoupené \nv ČR","importované \ndo ČR","vyrobené, nakoupené \nv ČR","importované \ndo ČR","vyrobené, nakoupené \nv ČR","importované \ndo ČR"]
[]
[]
["Plasty","PET","transparentní (6)",null,null,null,null,null,null,null,null,null,null,null,null,null,null,{"$f":"E10*F10*G10*H10*I10*J10*K10*L10*M10*N10*O10*P10*$R$2","v":0}]
[null,null,"průhledné barevné (8)",null,null,null,null,null,null,null,null,null,null,null,null,null,null,0]
[null,null,"neprůhledné barevné (9)",null,null,null,null,null,null,null,null,null,null,null,null,null,null,0]
[null,"PE","transparentní (6)",null,null,null,null,null,null,null,null,null,null,null,null,null,null,0]
[null,null,"barevné (7)",null,null,null,null,null,null,null,null,null,null,null,null,null,null,0]
[null,"PP","transparentní (6)",null,null,null,null,null,null,null,null,null,null,null,null,null,null,0]
[null,null,"barevné (7)",null,null,null,null,null,null,null,null,null,null,null,null,null,null,0]
[null,"PS","transparentní (6)",null,null,null,null,null,null,null,null,null,null,null,null,null,null,0]
[null,null,"barevné (7)",null,null,null,null,null,null,null,null,null,null,null,null,null,null,0]
[null,"XPS","transparentní (6)",null,null,null,null,null,null,null,null,null,null,null,null,null,null,0]
[null,null,"barevné (7)",null,null,null,null,null,null,null,null,null,null,null,null,null,null,0]
[null,"EPS","transparentní (6)",null,null,null,null,null,null,null,null,null,null,null,null,null,null,0]
[null,null,"barevné (7)",null,null,null,null,null,null,null,null,null,null,null,null,null,null,0]
[null,"PVC","transparentní (6)",null,null,null,null,null,null,null,null,null,null,null,null,null,null,0]
[null,null,"barevné (7)",null,null,null,null,null,null,null,null,null,null,null,null,null,null,0]
[null,"Jiné","transparentní (6)",null,null,null,null,null,null,null,null,null,null,null,null,null,null,0]
[null,null,"barevné (7)",null,null,null,null,null,null,null,null,null,null,null,null,null,null,0]
[null,"Biologicky rozložitelné (11)","transparentní (6)",null,null,null,null,null,null,null,null,null,null,null,null,null,null,0]
[null,null,"barevné (7)",null,null,null,null,null,null,null,null,null,null,null,null,null,null,0]
[null,"Kompozitní \n(10)","transparentní (6)",null,null,null,null,null,null,null,null,null,null,null,null,null,null,0]
[null,null,"barevné (7)",null,null,null,null,null,null,null,null,null,null,null,null,null,null,0]
["Kovy","Al",null,null,null,null,null,null,null,null,null,null,null,null,null,null,null,0]
[null,"Fe","FE",null,null,null,null,null,null,null,null,null,null,null,null,null,null,0]
[null,"Kompozitní Al (10)",null,null,null,null,null,null,null,null,null,null,null,null,null,null,null,0]
[null,"Kompozitní Fe (10)",null,null,null,null,null,null,null,null,null,null,null,null,null,null,null,0]
["Kompozitní materiál (10)",null,null,null,null,null,null,null,null,null,null,null,null,null,null,null,null,0]
[]
["Vyplňujte v tunách",null,null,null,"primární (4)",null,null,null,"recyklát (5)"]
[null,null,null,null,"vyrobené, nakoupené \nv ČR",null,"importované \ndo ČR",null,"vyrobené, nakoupené \nv ČR",null,"importované \ndo ČR"]
[]
["Sklo","Transparentní (6)",null,null,null,null,null,null,null,null,null,null,null,null,null,null,null,{"$f":"E40*G40*I40*K40*$R$2","v":0}]
[null,"Barevné (7)",null,null,null,null,null,null,null,null,null,null,null,null,null,null,null,0]
[null,"Kompozitní (10)",null,null,null,null,null,null,null,null,null,null,null,null,null,null,null,0]
["Papír","Papír",null,null,null,null,null,null,null,null,null,null,null,null,null,null,null,0]
[null,"Hladká lepenka",null,null,null,null,null,null,null,null,null,null,null,null,null,null,null,0]
[null,"Vlnitá lepenka",null,null,null,null,null,null,null,null,null,null,null,null,null,null,null,0]
[null,"Nasávaná kartonáž",null,null,null,null,null,null,null,null,null,null,null,null,null,null,null,0]
[null,"Kompozitní (10)",null,null,null,null,null,null,null,null,null,null,null,null,null,null,null,0]
["Dřevo","Dřevo a dřevotříska",null,null,null,null,null,null,null,null,null,null,null,null,null,null,null,0]
[null,"Kompozit s nedřevěnými částmi (10)",null,null,null,null,null,null,null,null,null,null,null,null,null,null,null,0]
["Textil",null,null,null,null,null,null,null,null,null,null,null,null,null,null,null,null,0]
["Jiné",null,null,null,null,null,null,null,null,null,null,null,null,null,null,null,null,0]
[]
["1) Obaly, které vyhovují kritériím § 13 odst. 3 zákona č. 477/2001 Sb., o obalech."]
["2) Obaly, které vyhovují kritériím uvedeným ve směrnici EU 2019/904 odst. 12."]
["3) Obaly, které nevyhovují § 2 písm. q)  zákona č. 477/2001 Sb., o obalech."]
["4) Množství primární suroviny v obalu."]
["5) Prokazatelné množství recyklovaného materiálu v obalu."]
["6) Obaly, čiré bez viditelného zabarvení."]
["7) Obaly, průhledné se zabarvením či zcela probarvené."]
["8) Obaly z PET, průhledné se zabarvením."]
["9) Obaly z PET, zcela probarvené."]
["10) Pokračujte ve vyplňovaní na listu O1-2K."]
["11) Biologickým rozkladem je aerobní nebo anaerobní rozklad odpadů z obalů; oxo-rozložitelný plastový obal se nepovažuje za obal rozložitelný biologickým rozkladem."]

{"sheet":"O1-2B","index":20,"n_rows":60,"n_cols":22,"rows_kept":60,"cut":false,"hidden":false,"merged":[[2,16,2,19],[48,14,48,15],[48,16,48,17],[48,18,48,19],[49,4,49,5],[49,6,49,7],[49,8,49,9],[49,10,49,11],[49,12,49,13],[49,14,49,15],[49,16,49,17],[49,18,49,19],[48,4,48,5],[48,6,48,7],[48,8,48,9],[48,10,48,11],[48,12,48,13],[46,14,46,15],[46,16,46,17],[46,18,46,19],[47,4,47,5],[47,6,47,7],[47,8,47,9],[47,10,47,11],[47,12,47,13],[47,14,47,15],[47,16,47,17],[47,18,47,19],[46,4,46,5],[46,6,46,7],[46,8,46,9],[46,10,46,11],[46,12,46,13],[44,14,44,15],[44,16,44,17],[44,18,44,19],[45,4,45,5],[45,6,45,7],[45,8,45,9],[45,10,45,11],[45,12,45,13],[45,14,45,15],[45,16,45,17],[45,18,45,19],[44,4,44,5],[44,6,44,7],[44,8,44,9],[44,10,44,11],[44,12,44,13],[42,14,42,15],[42,16,42,17],[42,18,42,19],[43,4,43,5],[43,6,43,7],[43,8,43,9],[43,10,43,11],[43,12,43,13],[43,14,43,15],[43,16,43,17],[43,18,43,19],[42,4,42,5],[42,6,42,7],[42,8,42,9],[42,10,42,11],[42,12,42,13],[38,14,40,15],[38,16,40,17],[38,18,40,19],[41,4,41,5],[41,6,41,7],[41,8,41,9],[41,10,41,11],[41,12,41,13],[41,14,41,15],[41,16,41,17],[41,18,41,19],[38,4,40,5],[38,6,40,7],[38,8,40,9],[38,10,40,11],[38,12,40,13],[36,4,36,11],[36,12,36,19],[37,4,37,7],[37,8,37,11],[37,12,37,15],[37,16,37,19],[0,0,0,4],[0,10,0,14],[0,5,0,9],[0,15,0,19],[1,0,1,16],[1,17,1,19],[6,16,6,17],[6,18,6,19],[3,0,9,3],[3,4,3,19],[4,4,4,11],[4,12,4,19],[5,4,5,7],[5,8,5,11],[5,12,5,15],[5,16,5,19],[6,4,6,5],[6,6,6,7],[7,9,9,9],[6,8,6,9],[6,10,6,11],[6,12,6,13],[6,14,6,15],[7,4,9,4],[7,5,9,5],[7,6,9,6],[7,7,9,7],[7,8,9,8],[7,16,9,16],[7,17,9,17],[7,18,9,18],[7,19,9,19],[10,0,29,0],[10,1,11,1],[10,2,10,3],[11,2,11,3],[12,1,13,1],[12,2,12,3],[7,10,9,10],[7,11,9,11],[7,12,9,12],[7,13,9,13],[7,14,9,14],[7,15,9,15],[13,2,13,3],[14,1,15,1],[14,2,14,3],[15,2,15,3],[16,1,17,1],[16,2,16,3],[17,2,17,3],[18,1,19,1],[18,2,18,3],[19,2,19,3],[20,1,21,1],[20,2,20,3],[21,2,21,3],[22,1,23,1],[22,2,22,3],[23,2,23,3],[24,1,25,1],[24,2,24,3],[25,2,25,3],[30,0,33,0],[30,1,30,3],[31,1,31,3],[32,1,32,3],[33,1,33,3],[26,1,27,1],[26,2,26,3],[27,2,27,3],[28,1,29,1],[29,2,29,3],[34,0,34,3],[36,0,40,3],[48,0,48,3],[49,0,49,3],[41,0,45,0],[41,1,41,3],[43,1,43,3],[44,1,44,3],[45,1,45,3],[46,0,47,0],[46,1,46,3],[47,1,47,3]]}
["opakované použití",null,null,null,null,"zpoplatněné",null,null,null,null,"obsahují nápoje",null,null,null,null,"skupinové a přepravní",null,null,null,null,null,{"$f":"V11*V12*V13*V14*V15*V16*V17*V18*V19*V20*V21*V22*V23*V24*V25*V26*V27*V28*V29*V30*V31*V32*V33*V34*V35*V42*V43*V44*V45*V46*V47*V48*V49*V50","v":0}]
["O1-2B Obaly pro opakované použití (1) - zpoplatněné",null,null,null,null,null,null,null,null,null,null,null,null,null,null,null,null,{"$f":"\"IČO: \"&Úvod!C12","v":"IČO: "},null,null,null,0]
["Výkaz o obalech, které obsahují nápoje (2) - skupinové a přepravní obaly uvedené na trh nebo do oběhu",null,null,null,null,null,null,null,null,null,null,null,null,null,null,null,{"$f":"Úvod!D4&Úvod!E4","v":"2. čtvrtletí roku 2025"}]
["Vyplňujte v tunách",null,null,null,"OBCHODNÍ (3)"]
[null,null,null,null,"Skupinové",null,null,null,null,null,null,null,"Přepravní"]
[null,null,null,null,"Měkké, flexibilní",null,null,null,"Pevné, pevné duté",null,null,null,"Měkké, flexibilní",null,null,null,"Pevné, pevné duté"]
[null,null,null,null,"primární (4)",null,"recyklát (5)",null,"primární (4)",null,"recyklát (5)",null,"primární (4)",null,"recyklát (5)",null,"primární (4)",null,"recyklát (5)"]
[null,null,null,null,"vyrobené, nakoupené \nv ČR","importované \ndo ČR","vyrobené, nakoupené \nv ČR","importované \ndo ČR","vyrobené, nakoupené \nv ČR","importované \ndo ČR","vyrobené, nakoupené \nv ČR","importované \ndo ČR","vyrobené, nakoupené \nv ČR","importované \ndo ČR","vyrobené, nakoupené \nv ČR","importované \ndo ČR","vyrobené, nakoupené \nv ČR","importované \ndo ČR","vyrobené, nakoupené \nv ČR","importované \ndo ČR"]
[]
[]
["Plasty","PET","transparentní (6)",null,null,null,null,null,null,null,null,null,null,null,null,null,null,null,null,null,null,{"$f":"E11*F11*G11*H11*I11*J11*K11*L11*M11*N11*O11*P11*Q11*R11*S11*T11*$V$2","v":0}]
[null,null,"barevné (7)",null,null,null,null,null,null,null,null,null,null,null,null,null,null,null,null,null,null,0]
[null,"PE","transparentní (6)",null,null,null,null,null,null,null,null,null,null,null,null,null,null,null,null,null,null,0]
[null,null,"barevné (7)",null,null,null,null,null,null,null,null,null,null,null,null,null,null,null,null,null,null,0]
[null,"PP","transparentní (6)",null,null,null,null,null,null,null,null,null,null,null,null,null,null,null,null,null,null,0]
[null,null,"barevné (7)",null,null,null,null,null,null,null,null,null,null,null,null,null,null,null,null,null,null,0]
[null,"PS","transparentní (6)",null,null,null,null,null,null,null,null,null,null,null,null,null,null,null,null,null,null,0]
[null,null,"barevné (7)",null,null,null,null,null,null,null,null,null,null,null,null,null,null,null,null,null,null,0]
[null,"XPS","transparentní (6)",null,null,null,null,null,null,null,null,null,null,null,null,null,null,null,null,null,null,0]
[null,null,"barevné (7)",null,null,null,null,null,null,null,null,null,null,null,null,null,null,null,null,null,null,0]
[null,"EPS","transparentní (6)",null,null,null,null,null,null,null,null,null,null,null,null,null,null,null,null,null,null,0]
[null,null,"barevné (7)",null,null,null,null,null,null,null,null,null,null,null,null,null,null,null,null,null,null,0]
[null,"PVC","transparentní (6)",null,null,null,null,null,null,null,null,null,null,null,null,null,null,null,null,null,null,0]
[null,null,"barevné (7)",null,null,null,null,null,null,null,null,null,null,null,null,null,null,null,null,null,null,0]
[null,"Jiné","transparentní (6)",null,null,null,null,null,null,null,null,null,null,null,null,null,null,null,null,null,null,0]
[null,null,"barevné (7)",null,null,null,null,null,null,null,null,null,null,null,null,null,null,null,null,null,null,0]
[null,"Biologicky rozložitelné (8)","transparentní (6)",null,null,null,null,null,null,null,null,null,null,null,null,null,null,null,null,null,null,0]
[null,null,"barevné (7)",null,null,null,null,null,null,null,null,null,null,null,null,null,null,null,null,null,null,0]
[null,"Kompozitní \n(9)","transparentní (6)",null,null,null,null,null,null,null,null,null,null,null,null,null,null,null,null,null,null,0]
[null,null,"barevné (7)",null,null,null,null,null,null,null,null,null,null,null,null,null,null,null,null,null,null,0]
["Kovy","Al",null,null,null,null,null,null,null,null,null,null,null,null,null,null,null,null,null,null,null,0]
[null,"Fe","FE",null,null,null,null,null,null,null,null,null,null,null,null,null,null,null,null,null,null,0]
[null,"Kompozitní Al (9)",null,null,null,null,null,null,null,null,null,null,null,null,null,null,null,null,null,null,null,0]
[null,"Kompozitní Fe (9)",null,null,null,null,null,null,null,null,null,null,null,null,null,null,null,null,null,null,null,0]
["Kompozitní materiál (9)",null,null,null,null,null,null,null,null,null,null,null,null,null,null,null,null,null,null,null,null,0]
[]
["Vyplňujte v tunách",null,null,null,"Skupinové",null,null,null,null,null,null,null,"Přepravní"]
[null,null,null,null,"primární (4)",null,null,null,"recyklát (5)",null,null,null,"primární (4)",null,null,null,"recyklát (5)"]
[null,null,null,null,"vyrobené, nakoupené \nv ČR",null,"importované \ndo ČR",null,"vyrobené, nakoupené \nv ČR",null,"importované \ndo ČR",null,"vyrobené, nakoupené \nv ČR",null,"importované \ndo ČR",null,"vyrobené, nakoupené \nv ČR",null,"importované \ndo ČR"]
[]
[]
["Papír","Papír",null,null,null,null,null,null,null,null,null,null,null,null,null,null,null,null,null,null,null,{"$f":"E42*G42*I42*K42*M42*O42*Q42*S42*$V$2","v":0}]
[null,"Hladká lepenka",null,null,null,null,null,null,null,null,null,null,null,null,null,null,null,null,null,null,null,0]
[null,"Vlnitá lepenka",null,null,null,null,null,null,null,null,null,null,null,null,null,null,null,null,null,null,null,0]
[null,"Nasávaná kartonáž",null,null,null,null,null,null,null,null,null,null,null,null,null,null,null,null,null,null,null,0]
[null,"Kompozitní (9)",null,null,null,null,null,null,null,null,null,null,null,null,null,null,null,null,null,null,null,0]
["Dřevo","Dřevo a dřevotříska",null,null,null,null,null,null,null,null,null,null,null,null,null,null,null,null,null,null,null,0]
[null,"Kompozit s nedřevěnými \nčástmi (9)",null,null,null,null,null,null,null,null,null,null,null,null,null,null,null,null,null,null,null,0]
["Textil",null,null,null,null,null,null,null,null,null,null,null,null,null,null,null,null,null,null,null,null,0]
["Jiné",null,null,null,null,null,null,null,null,null,null,null,null,null,null,null,null,null,null,null,null,0]
[]
["1) Obaly, které vyhovují kritériím § 13 odst. 3 zákona č. 477/2001 Sb., o obalech."]
["2) Obaly, které vyhovují kritériím uvedeným ve směrnici EU 2019/904 odst. 12."]
["3) Obaly, které nevyhovují § 2 písm. q)  zákona č. 477/2001 Sb., o obalech."]
["4) Množství primární suroviny v obalu."]
["5) Prokazatelné množství recyklovaného materiálu v obalu."]
["6) Obaly, čiré bez viditelného zabarvení."]
["7) Obaly, průhledné se zabarvením či zcela probarvené."]
["8) Biologickým rozkladem je aerobní nebo anaerobní rozklad odpadů z obalů; oxo-rozložitelný plastový obal se nepovažuje za obal rozložitelný biologickým rozkladem."]
["9) Pokračujte ve vyplňovaní na listu O1-2K."]

{"sheet":"O1-2K","index":21,"n_rows":25,"n_cols":16,"rows_kept":25,"cut":false,"hidden":false,"merged":[[2,10,2,13],[1,10,1,13],[1,0,1,8],[0,4,0,5],[0,6,0,7],[0,8,0,10],[0,11,0,13],[2,0,3,9],[0,0,0,3],[9,0,14,1],[9,2,9,3],[10,2,10,3],[11,2,11,3],[12,2,12,3],[13,2,13,3],[14,2,14,3],[4,0,8,3],[4,4,4,9],[5,4,5,5],[5,6,5,7],[5,8,5,9],[6,4,8,4],[6,5,8,5],[6,6,8,6],[6,7,8,7],[6,8,8,8],[6,9,8,9],[20,0,20,3],[15,0,16,1],[15,2,15,3],[16,2,16,3],[17,0,17,3],[18,0,18,3],[19,0,19,3]]}
["opakované použití",null,null,null,"zpoplatněné",null,"obsahují nápoje",null,"prodejní, skupinové a přepravní",null,null,"kompozitní",null,null,null,{"$f":"P10*P11*P12*P13*P14*P15*P16*P17*P18*P19*P20*P21","v":0}]
["O1-2K Obaly pro opakované použití (1) - zpoplatněné",null,null,null,null,null,null,null,null,null,{"$f":"\"IČO: \"&Úvod!C12","v":"IČO: "},null,null,null,null,0]
["Doplňující výkaz o obalech, které obsahují nápoje (2) - prodejní, skupinové a přepravní \n- kompozitní obaly uvedené na trh nebo do oběhu",null,null,null,null,null,null,null,null,null,{"$f":"Úvod!D4&Úvod!E4","v":"2. čtvrtletí roku 2025"}]
[]
["Vyplňujte v tunách",null,null,null,"OBCHODNÍ (3)"]
[null,null,null,null,"Prodejní",null,"Skupinové",null,"Přepravní"]
[null,null,null,null,"vyrobené, nakoupené \nv ČR","importované \ndo ČR","vyrobené, nakoupené \nv ČR","importované \ndo ČR","vyrobené, nakoupené \nv ČR","importované \ndo ČR"]
[]
[]
["Plasty",null,"PET",null,null,null,null,null,null,null,null,null,null,null,null,{"$f":"E10*F10*G10*H10*I10*J10*$P$2","v":0}]
[null,null,"PE",null,null,null,null,null,null,null,null,null,null,null,null,0]
[null,null,"PP",null,null,null,null,null,null,null,null,null,null,null,null,0]
[null,null,"PS",null,null,null,null,null,null,null,null,null,null,null,null,0]
[null,null,"PVC",null,null,null,null,null,null,null,null,null,null,null,null,0]
[null,null,"Jiné",null,null,null,null,null,null,null,null,null,null,null,null,0]
["Kovy",null,"Al",null,null,null,null,null,null,null,null,null,null,null,null,0]
[null,null,"Fe",null,null,null,null,null,null,null,null,null,null,null,null,0]
["Sklo",null,null,null,null,null,null,null,null,null,null,null,null,null,null,0]
["Papír a vlnitá lepenka",null,null,null,null,null,null,null,null,null,null,null,null,null,null,0]
["Dřevo",null,null,null,null,null,null,null,null,null,null,null,null,null,null,0]
["Jiné",null,null,null,null,null,null,null,null,null,null,null,null,null,null,0]
[]
["1) Obaly, které vyhovují kritériím § 13 odst. 3 zákona č. 477/2001 Sb., o obalech."]
["2) Obaly, které vyhovují kritériím uvedeným ve směrnici EU 2019/904 odst. 12."]
["3) Obaly, které nevyhovují § 2 písm. q)  zákona č. 477/2001 Sb., o obalech."]

{"sheet":"O1-3","index":22,"n_rows":63,"n_cols":22,"rows_kept":63,"cut":false,"hidden":false,"merged":[[2,0,2,15],[1,0,1,15],[2,16,2,19],[1,16,1,19],[51,4,51,5],[51,6,51,7],[51,8,51,9],[51,10,51,11],[51,12,51,13],[51,14,51,15],[51,16,51,17],[51,18,51,19],[47,4,47,5],[47,6,47,7],[47,8,47,9],[47,10,47,11],[47,12,47,13],[47,14,47,15],[47,16,47,17],[47,18,47,19],[48,4,48,5],[48,6,48,7],[48,8,48,9],[48,10,48,11],[52,4,52,5],[52,6,52,7],[52,8,52,9],[52,10,52,11],[52,12,52,13],[52,14,52,15],[52,16,52,17],[52,18,52,19],[49,4,49,5],[49,6,49,7],[49,8,49,9],[49,10,49,11],[49,12,49,13],[49,14,49,15],[49,16,49,17],[49,18,49,19],[50,4,50,5],[50,6,50,7],[50,8,50,9],[50,10,50,11],[50,12,50,13],[50,14,50,15],[50,16,50,17],[50,18,50,19],[48,12,48,13],[48,14,48,15],[48,16,48,17],[48,18,48,19],[45,4,45,5],[45,6,45,7],[45,8,45,9],[45,10,45,11],[45,12,45,13],[45,14,45,15],[45,16,45,17],[45,18,45,19],[46,4,46,5],[46,6,46,7],[46,8,46,9],[46,10,46,11],[46,12,46,13],[46,14,46,15],[46,16,46,17],[46,18,46,19],[43,4,43,5],[43,6,43,7],[43,8,43,9],[43,10,43,11],[43,12,43,13],[43,14,43,15],[43,16,43,17],[43,18,43,19],[44,4,44,5],[44,6,44,7],[44,8,44,9],[44,10,44,11],[44,12,44,13],[44,14,44,15],[44,16,44,17],[44,18,44,19],[41,4,41,5],[41,6,41,7],[41,8,41,9],[41,10,41,11],[41,12,41,13],[41,14,41,15],[41,16,41,17],[41,18,41,19],[42,4,42,5],[42,6,42,7],[42,8,42,9],[42,10,42,11],[42,12,42,13],[42,14,42,15],[42,16,42,17],[42,18,42,19],[36,4,36,11],[36,12,36,19],[37,4,37,7],[37,8,37,11],[37,12,37,15],[37,16,37,19],[38,4,40,5],[38,6,40,7],[38,8,40,9],[38,10,40,11],[38,12,40,13],[38,14,40,15],[38,16,40,17],[38,18,40,19],[7,19,9,19],[7,13,9,13],[7,14,9,14],[7,15,9,15],[7,16,9,16],[7,17,9,17],[7,10,9,10],[7,11,9,11],[7,12,9,12],[0,0,0,4],[0,10,0,14],[0,5,0,9],[0,15,0,19],[6,8,6,9],[6,10,6,11],[6,12,6,13],[6,14,6,15],[6,16,6,17],[6,18,6,19],[3,0,9,3],[3,4,3,19],[4,4,4,11],[4,12,4,19],[5,4,5,7],[5,8,5,11],[5,12,5,15],[5,16,5,19],[6,4,6,5],[6,6,6,7],[7,18,9,18],[7,4,9,4],[7,5,9,5],[7,6,9,6],[7,7,9,7],[7,8,9,8],[7,9,9,9],[23,2,23,3],[24,1,25,1],[24,2,24,3],[25,2,25,3],[18,1,19,1],[18,2,18,3],[19,2,19,3],[20,1,21,1],[20,2,20,3],[21,2,21,3],[22,1,23,1],[22,2,22,3],[26,1,27,1],[26,2,26,3],[27,2,27,3],[28,1,29,1],[29,2,29,3],[30,0,33,0],[30,1,30,3],[31,1,31,3],[32,1,32,3],[33,1,33,3],[10,0,29,0],[10,1,11,1],[10,2,10,3],[11,2,11,3],[12,1,13,1],[12,2,12,3],[13,2,13,3],[14,1,15,1],[14,2,14,3],[15,2,15,3],[16,1,17,1],[16,2,16,3],[17,2,17,3],[34,0,34,3],[36,0,40,3],[49,0,50,0],[49,1,49,3],[50,1,50,3],[51,0,51,3],[52,0,52,3],[41,0,43,0],[41,1,41,3],[42,1,42,3],[43,1,43,3],[44,0,48,0],[44,1,44,3],[46,1,46,3],[47,1,47,3],[48,1,48,3]]}
["opakované použití",null,null,null,null,"zpoplatněné",null,null,null,null,"průmyslové",null,null,null,null,"neobsahují i obsahují nápoje",null,null,null,null,null,{"$f":"V11*V12*V13*V14*V15*V16*V17*V18*V19*V20*V21*V22*V23*V24*V25*V26*V27*V28*V29*V30*V31*V32*V33*V34*V35*V42*V43*V44*V45*V46*V47*V48*V49*V50*V51*V52*V53","v":0}]
["O1-3 Obaly pro opakované použití (1) - zpoplatněné",null,null,null,null,null,null,null,null,null,null,null,null,null,null,null,{"$f":"\"IČO: \"&Úvod!C12","v":"IČO: "},null,null,null,null,0]
["Výkaz o obalech určených výhradně jinému konečnému uživateli, tzv. průmyslové (2) \n- uvedené na trh nebo do oběhu",null,null,null,null,null,null,null,null,null,null,null,null,null,null,null,{"$f":"Úvod!D4&Úvod!E4","v":"2. čtvrtletí roku 2025"}]
["Vyplňujte v tunách",null,null,null,"PRŮMYSLOVÉ (2)"]
[null,null,null,null,"Neobsahují nápoje (3)",null,null,null,null,null,null,null,"Obsahují nápoje"]
[null,null,null,null,"Měkké, flexibilní",null,null,null,"Pevné, pevné duté",null,null,null,"Měkké, flexibilní",null,null,null,"Pevné, pevné duté"]
[null,null,null,null,"primární (4)",null,"recyklát (5)",null,"primární (4)",null,"recyklát (5)",null,"primární (4)",null,"recyklát (5)",null,"primární (4)",null,"recyklát (5)"]
[null,null,null,null,"vyrobené, nakoupené \nv ČR","importované \ndo ČR","vyrobené, nakoupené \nv ČR","importované \ndo ČR","vyrobené, nakoupené \nv ČR","importované \ndo ČR","vyrobené, nakoupené \nv ČR","importované \ndo ČR","vyrobené, nakoupené \nv ČR","importované \ndo ČR","vyrobené, nakoupené \nv ČR","importované \ndo ČR","vyrobené, nakoupené \nv ČR","importované \ndo ČR","vyrobené, nakoupené \nv ČR","importované \ndo ČR"]
[]
[]
["Plasty","PET","transparentní (6)",null,null,null,null,null,null,null,null,null,null,null,null,null,null,null,null,null,null,{"$f":"E11*F11*G11*H11*I11*J11*K11*L11*M11*N11*O11*P11*Q11*R11*S11*T11*$V$2","v":0}]
[null,null,"barevné (7)",null,null,null,null,null,null,null,null,null,null,null,null,null,null,null,null,null,null,0]
[null,"PE","transparentní (6)",null,null,null,null,null,null,null,null,null,null,null,null,null,null,null,null,null,null,0]
[null,null,"barevné (7)",null,null,null,null,null,null,null,null,null,null,null,null,null,null,null,null,null,null,0]
[null,"PP","transparentní (6)",null,null,null,null,null,null,null,null,null,null,null,null,null,null,null,null,null,null,0]
[null,null,"barevné (7)",null,null,null,null,null,null,null,null,null,null,null,null,null,null,null,null,null,null,0]
[null,"PS","transparentní (6)",null,null,null,null,null,null,null,null,null,null,null,null,null,null,null,null,null,null,0]
[null,null,"barevné (7)",null,null,null,null,null,null,null,null,null,null,null,null,null,null,null,null,null,null,0]
[null,"XPS","transparentní (6)",null,null,null,null,null,null,null,null,null,null,null,null,null,null,null,null,null,null,0]
[null,null,"barevné (7)",null,null,null,null,null,null,null,null,null,null,null,null,null,null,null,null,null,null,0]
[null,"EPS","transparentní (6)",null,null,null,null,null,null,null,null,null,null,null,null,null,null,null,null,null,null,0]
[null,null,"barevné (7)",null,null,null,null,null,null,null,null,null,null,null,null,null,null,null,null,null,null,0]
[null,"PVC","transparentní (6)",null,null,null,null,null,null,null,null,null,null,null,null,null,null,null,null,null,null,0]
[null,null,"barevné (7)",null,null,null,null,null,null,null,null,null,null,null,null,null,null,null,null,null,null,0]
[null,"Jiné","transparentní (6)",null,null,null,null,null,null,null,null,null,null,null,null,null,null,null,null,null,null,0]
[null,null,"barevné (7)",null,null,null,null,null,null,null,null,null,null,null,null,null,null,null,null,null,null,0]
[null,"Biologicky rozložitelné (8)","transparentní (6)",null,null,null,null,null,null,null,null,null,null,null,null,null,null,null,null,null,null,0]
[null,null,"barevné (7)",null,null,null,null,null,null,null,null,null,null,null,null,null,null,null,null,null,null,0]
[null,"Kompozitní \n(9)","transparentní (6)",null,null,null,null,null,null,null,null,null,null,null,null,null,null,null,null,null,null,0]
[null,null,"barevné (7)",null,null,null,null,null,null,null,null,null,null,null,null,null,null,null,null,null,null,0]
["Kovy","Al",null,null,null,null,null,null,null,null,null,null,null,null,null,null,null,null,null,null,null,0]
[null,"Fe","FE",null,null,null,null,null,null,null,null,null,null,null,null,null,null,null,null,null,null,0]
[null,"Kompozitní Al (9)",null,null,null,null,null,null,null,null,null,null,null,null,null,null,null,null,null,null,null,0]
[null,"Kompozitní Fe (9)",null,null,null,null,null,null,null,null,null,null,null,null,null,null,null,null,null,null,null,0]
["Kompozitní materiál (9)",null,null,null,null,null,null,null,null,null,null,null,null,null,null,null,null,null,null,null,null,0]
[]
["Vyplňujte v tunách",null,null,null,"Neobsahují nápoje (3)",null,null,null,null,null,null,null,"Obsahují nápoje"]
[null,null,null,null,"primární (4)",null,null,null,"recyklát (5)",null,null,null,"primární (4)",null,null,null,"recyklát (5)"]
[null,null,null,null,"vyrobené, nakoupené \nv ČR",null,"importované \ndo ČR",null,"vyrobené, nakoupené \nv ČR",null,"importované \ndo ČR",null,"vyrobené, nakoupené \nv ČR",null,"importované \ndo ČR",null,"vyrobené, nakoupené \nv ČR",null,"importované \ndo ČR"]
[]
[]
["Sklo","Transparentní (6)",null,null,null,null,null,null,null,null,null,null,null,null,null,null,null,null,null,null,null,{"$f":"E42*G42*I42*K42*M42*O42*Q42*S42*$V$2","v":0}]
[null,"Barevné (7)",null,null,null,null,null,null,null,null,null,null,null,null,null,null,null,null,null,null,null,0]
[null,"Kompozitní (9)",null,null,null,null,null,null,null,null,null,null,null,null,null,null,null,null,null,null,null,0]
["Papír","Papír",null,null,null,null,null,null,null,null,null,null,null,null,null,null,null,null,null,null,null,0]
[null,"Hladká lepenka",null,null,null,null,null,null,null,null,null,null,null,null,null,null,null,null,null,null,null,0]
[null,"Vlnitá lepenka",null,null,null,null,null,null,null,null,null,null,null,null,null,null,null,null,null,null,null,0]
[null,"Nasávaná kartonáž",null,null,null,null,null,null,null,null,null,null,null,null,null,null,null,null,null,null,null,0]
[null,"Kompozitní (9)",null,null,null,null,null,null,null,null,null,null,null,null,null,null,null,null,null,null,null,0]
["Dřevo","Dřevo a dřevotříska",null,null,null,null,null,null,null,null,null,null,null,null,null,null,null,null,null,null,null,0]
[null,"Kompozit s nedřevěnými \nčástmi (9)",null,null,null,null,null,null,null,null,null,null,null,null,null,null,null,null,null,null,null,0]
["Textil",null,null,null,null,null,null,null,null,null,null,null,null,null,null,null,null,null,null,null,null,0]
["Jiné",null,null,null,null,null,null,null,null,null,null,null,null,null,null,null,null,null,null,null,null,0]
[]
["1) Obaly, které vyhovují kritériím § 13 odst. 3 zákona č. 477/2001 Sb., o obalech."]
["2) Obaly, které vyhovují § 2 písm. q) zákona č. 477/2001 Sb., o obalech."]
["3) Obaly, které nevyhovují kritériím uvedeným ve směrnici EU 2019/904 odst. 12."]
["4) Množství primární suroviny v obalu."]
["5) Prokazatelné množství recyklovaného materiálu v obalu."]
["6) Obaly, čiré bez viditelného zabarvení."]
["7) Obaly, průhledné se zabarvením či zcela probarvené."]
["8) Biologickým rozkladem je aerobní nebo anaerobní rozklad odpadů z obalů; oxo-rozložitelný plastový obal se nepovažuje za obal rozložitelný biologickým rozkladem."]
["9) Pokračujte ve vyplňovaní na listu O1-3K."]

{"sheet":"O1-3K","index":23,"n_rows":26,"n_cols":18,"rows_kept":26,"cut":false,"hidden":false,"merged":[[0,13,0,15],[0,0,0,3],[1,0,1,8],[0,4,0,5],[0,6,0,7],[0,8,0,12],[2,0,3,11],[1,12,1,15],[2,12,2,15],[4,0,9,3],[4,4,4,7],[5,4,6,5],[5,6,6,7],[7,4,9,4],[7,5,9,5],[7,6,9,6],[7,7,9,7],[10,0,15,1],[10,2,10,3],[11,2,11,3],[12,2,12,3],[13,2,13,3],[14,2,14,3],[15,2,15,3],[21,0,21,3],[16,0,17,1],[16,2,16,3],[17,2,17,3],[18,0,18,3],[19,0,19,3],[20,0,20,3]]}
["opakované použití",null,null,null,"zpoplatněné",null,"průmyslové",null,"neobsahují i obsahují nápoje",null,null,null,null,"kompozitní",null,null,null,{"$f":"R11*R12*R13*R14*R15*R16*R17*R18*R19*R20*R21*R22","v":0}]
["O1-3K Obaly pro opakované použití (1) - zpoplatněné",null,null,null,null,null,null,null,null,null,null,null,{"$f":"\"IČO: \"&Úvod!C12","v":"IČO: "},null,null,null,null,0]
["Doplňující výkaz o obalech určených výhradně jinému konečnému uživateli, tzv. průmyslové (2) \n- kompozitní obaly uvedené na trh nebo do oběhu",null,null,null,null,null,null,null,null,null,null,null,{"$f":"Úvod!D4&Úvod!E4","v":"2. čtvrtletí roku 2025"}]
[]
["Vyplňujte v tunách",null,null,null,"PRŮMYSLOVÉ (2)"]
[null,null,null,null,"Neobsahují nápoje (3)",null,"Obsahují \nnápoje"]
[]
[null,null,null,null,"vyrobené, nakoupené \nv ČR","importované \ndo ČR","vyrobené, nakoupené \nv ČR","importované \ndo ČR"]
[]
[]
["Plasty",null,"PET",null,null,null,null,null,null,null,null,null,null,null,null,null,null,{"$f":"E11*F11*G11*H11*$R$2","v":0}]
[null,null,"PE",null,null,null,null,null,null,null,null,null,null,null,null,null,null,0]
[null,null,"PP",null,null,null,null,null,null,null,null,null,null,null,null,null,null,0]
[null,null,"PS",null,null,null,null,null,null,null,null,null,null,null,null,null,null,0]
[null,null,"PVC",null,null,null,null,null,null,null,null,null,null,null,null,null,null,0]
[null,null,"Jiné",null,null,null,null,null,null,null,null,null,null,null,null,null,null,0]
["Kovy",null,"Al",null,null,null,null,null,null,null,null,null,null,null,null,null,null,0]
[null,null,"Fe",null,null,null,null,null,null,null,null,null,null,null,null,null,null,0]
["Sklo",null,null,null,null,null,null,null,null,null,null,null,null,null,null,null,null,0]
["Papír a vlnitá lepenka",null,null,null,null,null,null,null,null,null,null,null,null,null,null,null,null,0]
["Dřevo",null,null,null,null,null,null,null,null,null,null,null,null,null,null,null,null,0]
["Jiné",null,null,null,null,null,null,null,null,null,null,null,null,null,null,null,null,0]
[]
["1) Obaly, které vyhovují kritériím § 13 odst. 3 zákona č. 477/2001 Sb., o obalech."]
["2) Obaly, které vyhovují § 2 písm. q) zákona č. 477/2001 Sb., o obalech."]
["3) Obaly, které nevyhovují kritériím uvedeným ve směrnici EU 2019/904 odst. 12."]

{"sheet":"O2","index":24,"n_rows":25,"n_cols":14,"rows_kept":25,"cut":false,"hidden":false,"merged":[[5,9,7,9],[5,10,7,10],[5,11,7,11],[3,0,7,3],[3,4,3,9],[3,10,4,11],[4,4,4,5],[4,6,4,7],[4,8,4,9],[5,4,7,4],[5,5,7,5],[5,6,7,6],[5,7,7,7],[5,8,7,8],[1,0,1,6],[2,0,2,8],[0,0,0,3],[0,4,0,7],[0,8,0,11],[2,10,2,11],[1,10,1,11],[20,0,20,3],[13,2,13,3],[14,0,15,1],[14,2,14,3],[15,2,15,3],[16,0,16,3],[17,0,17,3],[18,0,18,3],[8,0,13,1],[8,2,8,3],[9,2,9,3],[10,2,10,3],[11,2,11,3],[12,2,12,3]]}
["opakované použití",null,null,null,"předplacené",null,null,null,"prodejní, skupinové, přepravní a průmyslové",null,null,null,null,{"$f":"N9*N10*N11*N12*N13*N14*N15*N16*N17*N18*N19*N20*N21","v":0}]
["O2 Obaly pro opakované použití (1) - předplacené",null,null,null,null,null,null,null,null,null,{"$f":"\"IČO: \"&Úvod!C12","v":"IČO: "},null,null,0]
["Výkaz o předplacených obalech uvedených na trh nebo do oběhu",null,null,null,null,null,null,null,null,null,{"$f":"Úvod!D4&Úvod!E4","v":"2. čtvrtletí roku 2025"}]
["Vyplňujte v tunách",null,null,null,"OBCHODNÍ (2)",null,null,null,null,null,"PRŮMYSLOVÉ (3)"]
[null,null,null,null,"Prodejní",null,"Skupinové",null,"Přepravní"]
[null,null,null,null,"vyrobené, nakoupené \nv ČR","importované \ndo ČR","vyrobené, nakoupené \nv ČR","importované \ndo ČR","vyrobené, nakoupené \nv ČR","importované \ndo ČR","vyrobené, nakoupené \nv ČR","importované \ndo ČR"]
[]
[]
["Plasty",null,"PET",null,null,null,null,null,null,null,null,null,null,{"$f":"E9*F9*G9*H9*I9*J9*K9*L9*$N$2","v":0}]
[null,null,"PE",null,null,null,null,null,null,null,null,null,null,0]
[null,null,"PP",null,null,null,null,null,null,null,null,null,null,0]
[null,null,"PS",null,null,null,null,null,null,null,null,null,null,0]
[null,null,"PVC",null,null,null,null,null,null,null,null,null,null,0]
[null,null,"Jiné",null,null,null,null,null,null,null,null,null,null,0]
["Kovy",null,"Al",null,null,null,null,null,null,null,null,null,null,0]
[null,null,"Fe",null,null,null,null,null,null,null,null,null,null,0]
["Sklo",null,null,null,null,null,null,null,null,null,null,null,null,0]
["Papír a vlnitá lepenka",null,null,null,null,null,null,null,null,null,null,null,null,0]
["Dřevo",null,null,null,null,null,null,null,null,null,null,null,null,0]
["Textil",null,null,null,null,null,null,null,null,null,null,null,null,0]
["Jiné",null,null,null,null,null,null,null,null,null,null,null,null,0]
[]
["1) Obaly, které vyhovují kritériím § 13 odst. 3 zákona č. 477/2001 Sb., o obalech."]
["2) Obaly, které nevyhovují § 2 písm. q)  zákona č. 477/2001 Sb., o obalech."]
["3) Obaly, které vyhovují § 2 písm. q) zákona č. 477/2001 Sb., o obalech."]

{"sheet":"O3","index":25,"n_rows":25,"n_cols":14,"rows_kept":25,"cut":false,"hidden":false,"merged":[[5,9,7,9],[5,10,7,10],[5,11,7,11],[3,0,7,3],[3,4,3,9],[3,10,4,11],[4,4,4,5],[4,6,4,7],[4,8,4,9],[5,4,7,4],[5,5,7,5],[5,6,7,6],[5,7,7,7],[5,8,7,8],[1,0,1,6],[2,0,2,8],[0,0,0,3],[0,4,0,7],[0,8,0,11],[1,10,1,11],[2,10,2,11],[20,0,20,3],[13,2,13,3],[14,0,15,1],[14,2,14,3],[15,2,15,3],[16,0,16,3],[17,0,17,3],[18,0,18,3],[8,0,13,1],[8,2,8,3],[9,2,9,3],[10,2,10,3],[11,2,11,3],[12,2,12,3]]}
["opakované použití",null,null,null,"neplacené",null,null,null,"prodejní, skupinové, přepravní a průmyslové",null,null,null,null,{"$f":"N9*N10*N11*N12*N13*N14*N15*N16*N17*N18*N19*N20*N21","v":0}]
["O3 Obaly pro opakované použití (1) - neplacené",null,null,null,null,null,null,null,null,null,{"$f":"\"IČO: \"&Úvod!C12","v":"IČO: "},null,null,0]
["Výkaz o neplacených obalech uvedených na trh nebo do oběhu",null,null,null,null,null,null,null,null,null,{"$f":"Úvod!D4&Úvod!E4","v":"2. čtvrtletí roku 2025"}]
["Vyplňujte v tunách",null,null,null,"OBCHODNÍ (2)",null,null,null,null,null,"PRŮMYSLOVÉ (3)"]
[null,null,null,null,"Prodejní",null,"Skupinové",null,"Přepravní"]
[null,null,null,null,"vyrobené, nakoupené \nv ČR","importované \ndo ČR","vyrobené, nakoupené \nv ČR","importované \ndo ČR","vyrobené, nakoupené \nv ČR","importované \ndo ČR","vyrobené, nakoupené \nv ČR","importované \ndo ČR"]
[]
[]
["Plasty",null,"PET",null,null,null,null,null,null,null,null,null,null,{"$f":"E9*F9*G9*H9*I9*J9*K9*L9*$N$2","v":0}]
[null,null,"PE",null,null,null,null,null,null,null,null,null,null,0]
[null,null,"PP",null,null,null,null,null,null,null,null,null,null,0]
[null,null,"PS",null,null,null,null,null,null,null,null,null,null,0]
[null,null,"PVC",null,null,null,null,null,null,null,null,null,null,0]
[null,null,"Jiné",null,null,null,null,null,null,null,null,null,null,0]
["Kovy",null,"Al",null,null,null,null,null,null,null,null,null,null,0]
[null,null,"Fe",null,null,null,null,null,null,null,null,null,null,0]
["Sklo",null,null,null,null,null,null,null,null,null,null,null,null,0]
["Papír a vlnitá lepenka",null,null,null,null,null,null,null,null,null,null,null,null,0]
["Dřevo",null,null,null,null,null,null,null,null,null,null,null,null,0]
["Textil",null,null,null,null,null,null,null,null,null,null,null,null,0]
["Jiné",null,null,null,null,null,null,null,null,null,null,null,null,0]
[]
["1) Obaly, které vyhovují kritériím § 13 odst. 3 zákona č. 477/2001 Sb., o obalech."]
["2) Obaly, které nevyhovují § 2 písm. q)  zákona č. 477/2001 Sb., o obalech."]
["3) Obaly, které vyhovují § 2 písm. q) zákona č. 477/2001 Sb., o obalech."]

{"sheet":"O4","index":26,"n_rows":25,"n_cols":14,"rows_kept":25,"cut":false,"hidden":false,"merged":[[5,9,7,9],[5,10,7,10],[5,11,7,11],[3,0,7,3],[3,4,3,9],[3,10,4,11],[4,4,4,5],[4,6,4,7],[4,8,4,9],[5,4,7,4],[5,5,7,5],[5,6,7,6],[5,7,7,7],[5,8,7,8],[1,0,1,6],[2,0,2,8],[0,0,0,3],[0,4,0,7],[0,8,0,11],[2,10,2,11],[1,10,1,11],[20,0,20,3],[13,2,13,3],[14,0,15,1],[14,2,14,3],[15,2,15,3],[16,0,16,3],[17,0,17,3],[18,0,18,3],[8,0,13,1],[8,2,8,3],[9,2,9,3],[10,2,10,3],[11,2,11,3],[12,2,12,3]]}
["opakované použití",null,null,null,"exportované",null,null,null,"prodejní, skupinové, přepravní a průmyslové",null,null,null,null,{"$f":"N9*N10*N11*N12*N13*N14*N15*N16*N17*N18*N19*N20*N21","v":0}]
["O4 Obaly pro opakované použití (1) - exportované",null,null,null,null,null,null,null,null,null,{"$f":"\"IČO: \"&Úvod!C12","v":"IČO: "},null,null,0]
["Výkaz o exportovaných obalech uvedených na trh nebo do oběhu",null,null,null,null,null,null,null,null,null,{"$f":"Úvod!D4&Úvod!E4","v":"2. čtvrtletí roku 2025"}]
["Vyplňujte v tunách",null,null,null,"OBCHODNÍ (2)",null,null,null,null,null,"PRŮMYSLOVÉ (3)"]
[null,null,null,null,"Prodejní",null,"Skupinové",null,"Přepravní"]
[null,null,null,null,"vyrobené, nakoupené \nv ČR","importované \ndo ČR","vyrobené, nakoupené \nv ČR","importované \ndo ČR","vyrobené, nakoupené \nv ČR","importované \ndo ČR","vyrobené, nakoupené \nv ČR","importované \ndo ČR"]
[]
[]
["Plasty",null,"PET",null,null,null,null,null,null,null,null,null,null,{"$f":"E9*F9*G9*H9*I9*J9*K9*L9*$N$2","v":0}]
[null,null,"PE",null,null,null,null,null,null,null,null,null,null,0]
[null,null,"PP",null,null,null,null,null,null,null,null,null,null,0]
[null,null,"PS",null,null,null,null,null,null,null,null,null,null,0]
[null,null,"PVC",null,null,null,null,null,null,null,null,null,null,0]
[null,null,"Jiné",null,null,null,null,null,null,null,null,null,null,0]
["Kovy",null,"Al",null,null,null,null,null,null,null,null,null,null,0]
[null,null,"Fe",null,null,null,null,null,null,null,null,null,null,0]
["Sklo",null,null,null,null,null,null,null,null,null,null,null,null,0]
["Papír a vlnitá lepenka",null,null,null,null,null,null,null,null,null,null,null,null,0]
["Dřevo",null,null,null,null,null,null,null,null,null,null,null,null,0]
["Textil",null,null,null,null,null,null,null,null,null,null,null,null,0]
["Jiné",null,null,null,null,null,null,null,null,null,null,null,null,0]
[]
["1) Obaly, které vyhovují kritériím § 13 odst. 3 zákona č. 477/2001 Sb., o obalech."]
["2) Obaly, které nevyhovují § 2 písm. q)  zákona č. 477/2001 Sb., o obalech."]
["3) Obaly, které vyhovují § 2 písm. q) zákona č. 477/2001 Sb., o obalech."]

{"sheet":"S1","index":27,"n_rows":27,"n_cols":20,"rows_kept":27,"cut":false,"hidden":false,"merged":[[1,0,1,7],[0,0,0,13],[24,0,24,11],[22,0,22,10],[0,15,0,17],[1,15,1,17],[4,3,7,3],[4,4,7,4],[4,5,7,5],[4,6,7,6],[4,7,7,7],[4,8,7,8],[4,9,7,9],[4,10,7,10],[4,11,7,11],[4,12,7,12],[4,13,7,13],[4,14,7,14],[4,15,7,15],[8,12,13,12],[8,17,13,17],[19,0,19,2],[20,0,20,2],[14,0,15,0],[16,0,16,2],[8,0,13,0],[12,1,12,2],[13,1,13,2],[14,1,14,2],[15,1,15,2],[9,1,9,2],[10,1,10,2],[17,0,17,2],[18,0,18,2],[16,11,16,12],[16,16,16,17],[16,6,16,7],[2,0,7,2],[2,13,3,17],[2,3,2,12],[14,6,15,7],[14,11,15,12],[14,16,15,17],[3,3,3,7],[3,8,3,12],[8,7,13,7],[11,1,11,2],[4,16,7,16],[8,1,8,2],[4,17,7,17]]}
["S1 Obaly pro opakované použití (1) – vyřazené z oběhu ",null,null,null,null,null,null,null,null,null,null,null,null,null,null,{"$f":"\"IČO: \"&Úvod!C12","v":"IČO: "},null,null,null,{"$f":"T9*T10*T11*T12*T13*T14*T15*T16*T17*T18*T19*T20*T21","v":0}]
[null,null,null,null,null,null,null,null,null,null,null,null,null,null,null,{"$f":"Úvod!D4&Úvod!E4","v":"2. čtvrtletí roku 2025"},null,null,null,0]
["Vyplňujte v tunách",null,null,"OBCHODNÍ (2)",null,null,null,null,null,null,null,null,null,"PRŮMYSLOVÉ (3)"]
[null,null,null,"Prodejní",null,null,null,null,"Skupinové, Přepravní"]
[null,null,null,"recyklováno \nv ČR","recyklováno v jiných členských státech \nEU","recyklováno mimo EU","energeticky využito","opravy dřevěných obalů","recyklováno \nv ČR","recyklováno v jiných členských státech \nEU","recyklováno mimo EU","energeticky využito","opravy dřevěných obalů","recyklováno \nv ČR","recyklováno v jiných členských státech \nEU","recyklováno mimo EU","energeticky využito","opravy dřevěných obalů"]
[]
[]
[]
["Plasty","PET",null,null,null,null,null,null,null,null,null,null,null,null,null,null,null,null,null,{"$f":"D9*E9*F9*G9*I9*J9*K9*L9*N9*O9*P9*Q9*$T$2","v":0}]
[null,"PE",null,null,null,null,null,null,null,null,null,null,null,null,null,null,null,null,null,0]
[null,"PP",null,null,null,null,null,null,null,null,null,null,null,null,null,null,null,null,null,0]
[null,"PS",null,null,null,null,null,null,null,null,null,null,null,null,null,null,null,null,null,0]
[null,"PVC",null,null,null,null,null,null,null,null,null,null,null,null,null,null,null,null,null,0]
[null,"Jiné",null,null,null,null,null,null,null,null,null,null,null,null,null,null,null,null,null,0]
["Kovy","Al",null,null,null,null,null,null,null,null,null,null,null,null,null,null,null,null,null,{"$f":"D15*E15*F15*I15*J15*K15*N15*O15*P15*$T$2","v":0}]
[null,"Fe",null,null,null,null,null,null,null,null,null,null,null,null,null,null,null,null,null,{"$f":"D16*E16*F16*I16*J16*K16*N16*O16*P16*$T$2","v":0}]
["Sklo",null,null,null,null,null,null,null,null,null,null,null,null,null,null,null,null,null,null,{"$f":"D17*E17*F17*I17*J17*K17*N17*O17*P17*$T$2","v":0}]
["Papír a vlnitá lepenka",null,null,null,null,null,null,null,null,null,null,null,null,null,null,null,null,null,null,{"$f":"D18*E18*F18*G18*I18*J18*K18*L18*N18*O18*P18*Q18*$T$2","v":0}]
["Dřevo",null,null,null,null,null,null,null,null,null,null,null,null,null,null,null,null,null,null,{"$f":"D19*E19*F19*G19*H19*I19*J19*K19*L19*M19*N19*O19*P19*R19*Q19*$T$2","v":0}]
["Textil",null,null,null,null,null,null,null,null,null,null,null,null,null,null,null,null,null,null,{"$f":"D20*E20*F20*G20*I20*J20*K20*L20*N20*O20*P20*Q20*$T$2","v":0}]
["Jiné ",null,null,null,null,null,null,null,null,null,null,null,null,null,null,null,null,null,null,{"$f":"D21*E21*F21*G21*I21*J21*K21*L21*N21*O21*P21*Q21*$T$2","v":0}]
[]
[]
["Obaly zde uvedené nejsou určeny ke zpoplatnění."]
["1) Obaly, které vyhovují kritériím § 13 odst. 3 zákona č. 477/2001 Sb., o obalech."]
["2) Obaly, které nevyhovují kritériím § 2 písm. q) zákona č. 477/2001 Sb., o obalech."]
["3) Obaly, které vyhovují § 2 písm. q) zákona č. 477/2001 Sb., o obalech."]

{"sheet":"S2","index":28,"n_rows":46,"n_cols":17,"rows_kept":46,"cut":false,"hidden":false,"merged":[[43,0,43,10],[36,0,36,1],[36,2,36,3],[37,0,37,1],[37,2,37,3],[38,0,38,1],[38,2,38,3],[39,0,39,1],[39,2,39,3],[40,0,40,1],[40,2,40,3],[41,0,41,1],[41,2,41,3],[33,2,33,3],[34,0,34,1],[34,2,34,3],[35,0,35,1],[35,2,35,3],[33,0,33,1],[31,0,32,1],[31,2,32,3],[31,4,32,4],[31,5,31,13],[24,0,24,1],[24,2,24,3],[25,0,25,1],[25,2,25,3],[26,0,26,1],[26,2,26,3],[27,0,27,1],[27,2,27,3],[28,0,28,1],[28,2,28,3],[30,0,30,13],[21,0,21,1],[21,2,21,3],[22,0,22,1],[22,2,22,3],[23,0,23,1],[23,2,23,3],[20,0,20,1],[20,2,20,3],[13,0,13,1],[13,2,13,3],[14,0,14,1],[14,2,14,3],[15,0,15,1],[15,2,15,3],[17,0,17,13],[18,0,19,1],[18,2,19,3],[18,4,19,4],[18,5,18,13],[10,0,10,1],[10,2,10,3],[11,0,11,1],[11,2,11,3],[12,0,12,1],[12,2,12,3],[7,0,7,1],[7,2,7,3],[8,0,8,1],[8,2,8,3],[9,0,9,1],[9,2,9,3],[0,0,0,10],[1,0,1,10],[4,0,4,13],[5,0,6,1],[5,4,6,4],[5,5,5,13],[2,0,3,13],[5,2,6,3],[1,11,1,13],[0,11,0,13]]}
["S2 Statistická evidence přepravek a palet z plastů ",null,null,null,null,null,null,null,null,null,null,{"$f":"\"IČO: \"&Úvod!C12","v":"IČO: "},null,null,null,null,{"$f":"Q8*Q9*Q10*Q11*Q12*Q13*Q14*Q15*Q16*Q21*Q22*Q23*Q24*Q25*Q26*Q27*Q28*Q29*Q34*Q35*Q36*Q37*Q38*Q39*Q40*Q41*Q42","v":0}]
["Obaly pro opakované použití (1)",null,null,null,null,null,null,null,null,null,null,{"$f":"Úvod!D4&Úvod!E4","v":"2. čtvrtletí roku 2025"},null,null,null,null,0]
["Vyplňují firmy přihlášené k Dobrovolné dohodě o opatřeních k zajištění plnění rozhodnutí Komise 2009/292/ES ze dne 24.3.2009, kterým se stanoví podmínky pro udělování výjimky ze směrnice Evropského parlamentu a Rady 94/62/ES o obalech a obalových odpadech pro přepravky a palety z plastů týkající se úrovní těžkých kovů."]
[]
["Používané obaly "]
["Typ přepravky",null,"Průměrný počet obrátek 1 opakovaně používaného obalu za sledované období ",null,"Hmotnost 1 kusu opakovaně používaného obalu - vyplňujte v TUNÁCH ","Opakovaně používané obaly 1) uvedené na trh nebo do oběhu (používané obaly)     vyplňujte v TUNÁCH",null,null,null,null,null,null,null,null,{"$f":"(O7/10^178)*(O20/10^178)*(O33/10^178)","v":0}]
[null,null,null,null,null,"zelená","hnědá","červená","červeno-hnědá","černá","modrá ","šedá","žlutá","ostatní",{"$f":"O8*O9*O10*O11*O12*O13*O14*O15*O16","v":0}]
["Přepravka pivo ALE ",null,null,null,null,null,null,null,null,null,null,null,null,null,{"$f":"C8*E8*F8*G8*H8*I8*J8*K8*L8*M8*N8","v":0},null,{"$f":"C8*E8*F8*G8*H8*I8*J8*K8*L8*M8*N8*$Q$2","v":0}]
["Přepravka pivo NRW ",null,null,null,null,null,null,null,null,null,null,null,null,null,{"$f":"C9*E9*F9*G9*H9*I9*J9*K9*L9*M9*N9","v":0},null,0]
["Přepravka nealko ",null,null,null,null,null,null,null,null,null,null,null,null,null,0,null,0]
["Přepravka pečivo  ",null,null,null,null,null,null,null,null,null,null,null,null,null,0,null,0]
["Přepravka ovoce - zelenina  ",null,null,null,null,null,null,null,null,null,null,null,null,null,0,null,0]
["Přepravka maso ",null,null,null,null,null,null,null,null,null,null,null,null,null,0,null,0]
["Přepravka uzeniny  ",null,null,null,null,null,null,null,null,null,null,null,null,null,0,null,0]
["Přepravky ostatní",null,null,null,null,null,null,null,null,null,null,null,null,null,0,null,0]
["Manipulační paleta",null,null,null,null,null,null,null,null,null,null,null,null,null,0,null,0]
[]
["Nově vyrobené obaly              "]
["Typ přepravky",null,"Počet kusů nově vyrobených obalů - vyplňujte v KUSECH",null,"Hmotnost 1 kusu nově vyrobeného obalu - vyplňujte v TUNÁCH ","Nově uvedené obaly na trh nebo do oběhu (nově vyrobené obaly)     vyplňujte v TUNÁCH"]
[null,null,null,null,null,"zelená","hnědá","červená","červeno-hnědá","černá","modrá ","šedá","žlutá","ostatní",{"$f":"O21*O22*O23*O24*O25*O26*O27*O28*O29","v":0}]
["Přepravka pivo ALE ",null,null,null,null,null,null,null,null,null,null,null,null,null,{"$f":"C21*E21*F21*G21*H21*I21*J21*K21*L21*M21*N21","v":0},null,{"$f":"C21*E21*F21*G21*H21*I21*J21*K21*L21*M21*N21*$Q$2","v":0}]
["Přepravka pivo NRW ",null,null,null,null,null,null,null,null,null,null,null,null,null,{"$f":"C22*E22*F22*G22*H22*I22*J22*K22*L22*M22*N22","v":0},null,0]
["Přepravka nealko ",null,null,null,null,null,null,null,null,null,null,null,null,null,0,null,0]
["Přepravka pečivo  ",null,null,null,null,null,null,null,null,null,null,null,null,null,0,null,0]
["Přepravka ovoce - zelenina  ",null,null,null,null,null,null,null,null,null,null,null,null,null,0,null,0]
["Přepravka maso ",null,null,null,null,null,null,null,null,null,null,null,null,null,0,null,0]
["Přepravka uzeniny  ",null,null,null,null,null,null,null,null,null,null,null,null,null,0,null,0]
["Přepravky ostatní",null,null,null,null,null,null,null,null,null,null,null,null,null,0,null,0]
["Manipulační paleta",null,null,null,null,null,null,null,null,null,null,null,null,null,0,null,0]
[]
["Vyřazené obaly "]
["Typ přepravky",null,"Počet kusů vyřazených obalů - vyplňujte v KUSECH",null,"Hmotnost 1 kusu vyřazeného obalu - vyplňujte v TUNÁCH ","Opakovaně používané obaly, které jsou vyřazeny z oběhu (vyřazené obaly)     vyplňujte v TUNÁCH"]
[null,null,null,null,null,"zelená","hnědá","červená","červeno-hnědá","černá","modrá ","šedá","žlutá","ostatní",{"$f":"O34*O35*O36*O37*O38*O39*O40*O41*O42","v":0}]
["Přepravka pivo ALE ",null,null,null,null,null,null,null,null,null,null,null,null,null,{"$f":"C34*E34*F34*G34*H34*I34*J34*K34*L34*M34*N34","v":0},null,{"$f":"C34*E34*F34*G34*H34*I34*J34*K34*L34*M34*N34*$Q$2","v":0}]
["Přepravka pivo NRW ",null,null,null,null,null,null,null,null,null,null,null,null,null,{"$f":"C35*E35*F35*G35*H35*I35*J35*K35*L35*M35*N35","v":0},null,0]
["Přepravka nealko ",null,null,null,null,null,null,null,null,null,null,null,null,null,0,null,0]
["Přepravka pečivo  ",null,null,null,null,null,null,null,null,null,null,null,null,null,0,null,0]
["Přepravka ovoce - zelenina  ",null,null,null,null,null,null,null,null,null,null,null,null,null,0,null,0]
["Přepravka maso ",null,null,null,null,null,null,null,null,null,null,null,null,null,0,null,0]
["Přepravka uzeniny  ",null,null,null,null,null,null,null,null,null,null,null,null,null,0,null,0]
["Přepravky ostatní",null,null,null,null,null,null,null,null,null,null,null,null,null,0,null,0]
["Manipulační paleta",null,null,null,null,null,null,null,null,null,null,null,null,null,0,null,0]
[]
["Tento výkaz slouží pouze pro vedení statistiky vybraných typů obalů."]
["Obaly zde uvedené nejsou určeny ke zpoplatnění."]
["1) Obaly, které vyhovují kritériím § 13 odst. 3 zákona č. 477/2001 Sb., o obalech."]